{"text_format":"1","workbook":"xlsx","n_sheets":5,"sheets":["Dashboard","Data","funnel","reason","trend"],"not_rendered":{"charts":6,"images":2,"macros":1,"external_links":0,"defined_names":15,"comments":0,"pivot_tables":3},"unopened":[],"bounds":{"document_bytes":16777216,"sheet_cells":100000,"rows_first":2000,"rows_last":500,"rows_between":2000,"halvings":0,"cell_chars":16384,"cell_head_chars":4096},"cells_cut":0,"cells_raw":0,"read":"whole","date_system":"1900"}

{"sheet":"Dashboard","index":0,"n_rows":0,"n_cols":0,"rows_kept":0,"cut":false,"hidden":false,"merged":[]}

{"sheet":"Data","index":1,"n_rows":624,"n_cols":38,"rows_kept":624,"cut":false,"hidden":false,"merged":[]}
["Unique Person ID","Notes","Age_cat","Sex","Hispanic","Race","Work limitation due to injury/illness","Earned gt 1000 per mo","Applied for SSI/SSDI last 5 yrs","Employment status","Weeks since injury","Primary injury/illness","Work-related injury","Workers comp","Industry","Occupation","Referral type","Referral source","Location","Primary contact type","Identified","Contacted","Reason not contacted","Eligible","Reason not eligible","Expressed interest","Reason not interested","Enrolled","Reason not enrolled","First service received","Reason first service not received","Date identified","Date first contacted","Date last contacted","Date enrolled","Date first service","Stage dropped","Reason dropped"]
[1013,"lorem ipsum","45 to 64 yrs","M","Non-Hispanic/Latino","White","Yes","Yes","No","Employed","2 to 6","Other","Work related","Workers comp","Industry 1","Occupation 3","Health provider","Clinic appointment schedules","County B","In person",1,1,null,1,null,0,"Don't want to be in research study",0,null,0,null,"2019-07-01","2019-07-16","2019-08-17",null,null,{"$f":"IF(Table1[[#This Row],[First service received]]=1,\"Never dropped\",IF(Table1[[#This Row],[Enrolled]]=1,\"No first service\",IF(Table1[[#This Row],[Expressed interest]]=1,\"Not enrolled\",IF(Table1[[#This Row],[Eligible]]=1,\"Not interested\",IF(Table1[[#This Row],[Contacted]]=1,\"Not eligible\",IF(Table1[[#This Row],[Identified]]=1,\"Not contacted\",\"\"))))))","v":"Not interested"},{"$f":"_xlfn.CONCAT(Table1[[#This Row],[Reason not contacted]],Table1[[#This Row],[Reason not eligible]],Table1[[#This Row],[Reason not interested]],Table1[[#This Row],[Reason not enrolled]],Table1[[#This Row],[Reason first service not received]])","v":"Don't want to be in research study"}]
[1131,null,"25 to 44 yrs","F","Hispanic/Latino","White","Yes","Yes","No","Employed","0 to 1","MSK","Work related","Non-workers comp","Industry 1","Occupation 1","Health provider","FMLA forms","County B","Email",1,0,"No contact info",0,null,0,null,0,null,0,null,"2019-07-01",null,null,null,null,{"$f":"IF(Table1[[#This Row],[First service received]]=1,\"Never dropped\",IF(Table1[[#This Row],[Enrolled]]=1,\"No first service\",IF(Table1[[#This Row],[Expressed interest]]=1,\"Not enrolled\",IF(Table1[[#This Row],[Eligible]]=1,\"Not interested\",IF(Table1[[#This Row],[Contacted]]=1,\"Not eligible\",IF(Table1[[#This Row],[Identified]]=1,\"Not contacted\",\"\"))))))","v":"Not contacted"},{"$f":"_xlfn.CONCAT(Table1[[#This Row],[Reason not contacted]],Table1[[#This Row],[Reason not eligible]],Table1[[#This Row],[Reason not interested]],Table1[[#This Row],[Reason not enrolled]],Table1[[#This Row],[Reason first service not received]])","v":"No contact info"}]
[1141,null,"25 to 44 yrs","M","Non-Hispanic/Latino","White","Yes","Yes","No","Not Employed","0 to 1","Other","Non-work related","Non-workers comp","Industry 3","Occupation 3","Health provider","Worker’s comp database","County B","Phone",1,1,null,0,"Ineligible reason2",0,null,0,null,0,null,"2019-07-01","2019-07-03","2019-07-10",null,null,{"$f":"IF(Table1[[#This Row],[First service received]]=1,\"Never dropped\",IF(Table1[[#This Row],[Enrolled]]=1,\"No first service\",IF(Table1[[#This Row],[Expressed interest]]=1,\"Not enrolled\",IF(Table1[[#This Row],[Eligible]]=1,\"Not interested\",IF(Table1[[#This Row],[Contacted]]=1,\"Not eligible\",IF(Table1[[#This Row],[Identified]]=1,\"Not contacted\",\"\"))))))","v":"Not eligible"},{"$f":"_xlfn.CONCAT(Table1[[#This Row],[Reason not contacted]],Table1[[#This Row],[Reason not eligible]],Table1[[#This Row],[Reason not interested]],Table1[[#This Row],[Reason not enrolled]],Table1[[#This Row],[Reason first service not received]])","v":"Ineligible reason2"}]
[1158,null,"45 to 64 yrs","M","Non-Hispanic/Latino","Asian","No","Yes","Yes","Not Employed","0 to 1","Cardio or Respiratory","Non-work related","Non-workers comp","Industry 4","Occupation 3","Health provider","Work restriction forms","County B","Email",1,1,null,1,null,1,null,1,null,1,null,"2019-07-01","2019-07-07","2019-07-21","2019-08-05","2019-08-11",{"$f":"IF(Table1[[#This Row],[First service received]]=1,\"Never dropped\",IF(Table1[[#This Row],[Enrolled]]=1,\"No first service\",IF(Table1[[#This Row],[Expressed interest]]=1,\"Not enrolled\",IF(Table1[[#This Row],[Eligible]]=1,\"Not interested\",IF(Table1[[#This Row],[Contacted]]=1,\"Not eligible\",IF(Table1[[#This Row],[Identified]]=1,\"Not contacted\",\"\"))))))","v":"Never dropped"},{"$f":"_xlfn.CONCAT(Table1[[#This Row],[Reason not contacted]],Table1[[#This Row],[Reason not eligible]],Table1[[#This Row],[Reason not interested]],Table1[[#This Row],[Reason not enrolled]],Table1[[#This Row],[Reason first service not received]])","v":""}]
[1183,null,"65 yrs +","F","Non-Hispanic/Latino","Black or African-American","Yes","Yes","No","Employed","2 to 6","MSK","Non-work related","Non-workers comp","Industry 1","Occupation 3","Workforce partner","Electronic Health Records","County B","In person",1,1,null,0,"Ineligible reason1",0,null,0,null,0,null,"2019-07-01","2019-07-14","2019-08-10",null,null,{"$f":"IF(Table1[[#This Row],[First service received]]=1,\"Never dropped\",IF(Table1[[#This Row],[Enrolled]]=1,\"No first service\",IF(Table1[[#This Row],[Expressed interest]]=1,\"Not enrolled\",IF(Table1[[#This Row],[Eligible]]=1,\"Not interested\",IF(Table1[[#This Row],[Contacted]]=1,\"Not eligible\",IF(Table1[[#This Row],[Identified]]=1,\"Not contacted\",\"\"))))))","v":"Not eligible"},{"$f":"_xlfn.CONCAT(Table1[[#This Row],[Reason not contacted]],Table1[[#This Row],[Reason not eligible]],Table1[[#This Row],[Reason not interested]],Table1[[#This Row],[Reason not enrolled]],Table1[[#This Row],[Reason first service not received]])","v":"Ineligible reason1"}]
[1442,null,"18 to 24 yrs","F","Non-Hispanic/Latino","Asian","Yes","Yes","No","Employed","7 to 12","MSK","Work related","Non-workers comp","Industry 2","Occupation 3","Health provider","Voc rehab centers","County B","Phone",1,1,null,1,null,1,null,1,null,1,null,"2019-07-01","2019-07-05","2019-07-11","2019-07-24","2019-08-05",{"$f":"IF(Table1[[#This Row],[First service received]]=1,\"Never dropped\",IF(Table1[[#This Row],[Enrolled]]=1,\"No first service\",IF(Table1[[#This Row],[Expressed interest]]=1,\"Not enrolled\",IF(Table1[[#This Row],[Eligible]]=1,\"Not interested\",IF(Table1[[#This Row],[Contacted]]=1,\"Not eligible\",IF(Table1[[#This Row],[Identified]]=1,\"Not contacted\",\"\"))))))","v":"Never dropped"},{"$f":"_xlfn.CONCAT(Table1[[#This Row],[Reason not contacted]],Table1[[#This Row],[Reason not eligible]],Table1[[#This Row],[Reason not interested]],Table1[[#This Row],[Reason not enrolled]],Table1[[#This Row],[Reason first service not received]])","v":""}]
[1587,null,"45 to 64 yrs","F","Non-Hispanic/Latino","White","Yes","Yes","No","Employed","7 to 12","MSK","Non-work related","Non-workers comp","Industry 2","Occupation 3","Self","Electronic Health Records","County B","Phone",1,1,null,0,"Ineligible reason1",0,null,0,null,0,null,"2019-07-01","2019-07-16","2019-07-20",null,null,{"$f":"IF(Table1[[#This Row],[First service received]]=1,\"Never dropped\",IF(Table1[[#This Row],[Enrolled]]=1,\"No first service\",IF(Table1[[#This Row],[Expressed interest]]=1,\"Not enrolled\",IF(Table1[[#This Row],[Eligible]]=1,\"Not interested\",IF(Table1[[#This Row],[Contacted]]=1,\"Not eligible\",IF(Table1[[#This Row],[Identified]]=1,\"Not contacted\",\"\"))))))","v":"Not eligible"},{"$f":"_xlfn.CONCAT(Table1[[#This Row],[Reason not contacted]],Table1[[#This Row],[Reason not eligible]],Table1[[#This Row],[Reason not interested]],Table1[[#This Row],[Reason not enrolled]],Table1[[#This Row],[Reason first service not received]])","v":"Ineligible reason1"}]
[1116,null,"25 to 44 yrs","M","Hispanic/Latino","White","Yes","Yes","No","Employed","2 to 6","MSK","Work related","Non-workers comp","Industry 3","Occupation 2","Health provider","Worker’s comp database","County B","Phone",1,1,null,1,null,1,null,1,null,1,null,"2019-07-02","2019-07-13","2019-07-26","2019-08-11","2019-08-20",{"$f":"IF(Table1[[#This Row],[First service received]]=1,\"Never dropped\",IF(Table1[[#This Row],[Enrolled]]=1,\"No first service\",IF(Table1[[#This Row],[Expressed interest]]=1,\"Not enrolled\",IF(Table1[[#This Row],[Eligible]]=1,\"Not interested\",IF(Table1[[#This Row],[Contacted]]=1,\"Not eligible\",IF(Table1[[#This Row],[Identified]]=1,\"Not contacted\",\"\"))))))","v":"Never dropped"},{"$f":"_xlfn.CONCAT(Table1[[#This Row],[Reason not contacted]],Table1[[#This Row],[Reason not eligible]],Table1[[#This Row],[Reason not interested]],Table1[[#This Row],[Reason not enrolled]],Table1[[#This Row],[Reason first service not received]])","v":""}]
[1133,null,"25 to 44 yrs","F","Non-Hispanic/Latino","White","Yes","Yes","No","Employed","0 to 1","Cardio or Respiratory","Non-work related","Non-workers comp","Industry 3","Occupation 2","Self","Electronic Health Records","County B","Phone",1,1,null,0,"Ineligible reason1",0,null,0,null,0,null,"2019-07-02","2019-07-10","2019-08-08",null,null,{"$f":"IF(Table1[[#This Row],[First service received]]=1,\"Never dropped\",IF(Table1[[#This Row],[Enrolled]]=1,\"No first service\",IF(Table1[[#This Row],[Expressed interest]]=1,\"Not enrolled\",IF(Table1[[#This Row],[Eligible]]=1,\"Not interested\",IF(Table1[[#This Row],[Contacted]]=1,\"Not eligible\",IF(Table1[[#This Row],[Identified]]=1,\"Not contacted\",\"\"))))))","v":"Not eligible"},{"$f":"_xlfn.CONCAT(Table1[[#This Row],[Reason not contacted]],Table1[[#This Row],[Reason not eligible]],Table1[[#This Row],[Reason not interested]],Table1[[#This Row],[Reason not enrolled]],Table1[[#This Row],[Reason first service not received]])","v":"Ineligible reason1"}]
[1146,null,"45 to 64 yrs","M","Non-Hispanic/Latino","White","Yes","Yes","No","Employed","0 to 1","Other","Work related","Workers comp","Industry 1","Occupation 3","Health provider","Clinic appointment schedules","County A","In person",1,1,null,1,null,1,null,1,null,1,null,"2019-07-02","2019-07-12","2019-07-25","2019-08-08","2019-08-14",{"$f":"IF(Table1[[#This Row],[First service received]]=1,\"Never dropped\",IF(Table1[[#This Row],[Enrolled]]=1,\"No first service\",IF(Table1[[#This Row],[Expressed interest]]=1,\"Not enrolled\",IF(Table1[[#This Row],[Eligible]]=1,\"Not interested\",IF(Table1[[#This Row],[Contacted]]=1,\"Not eligible\",IF(Table1[[#This Row],[Identified]]=1,\"Not contacted\",\"\"))))))","v":"Never dropped"},{"$f":"_xlfn.CONCAT(Table1[[#This Row],[Reason not contacted]],Table1[[#This Row],[Reason not eligible]],Table1[[#This Row],[Reason not interested]],Table1[[#This Row],[Reason not enrolled]],Table1[[#This Row],[Reason first service not received]])","v":""}]
[1226,null,"65 yrs +","M","Non-Hispanic/Latino","White","Yes","Yes","No","Not Employed","0 to 1","Other","Non-work related","Non-workers comp","Industry 3","Occupation 2","Health provider","Voc rehab centers","County B","Email",1,1,null,0,"Ineligible reason1",0,null,0,null,0,null,"2019-07-02","2019-07-11","2019-07-12",null,null,{"$f":"IF(Table1[[#This Row],[First service received]]=1,\"Never dropped\",IF(Table1[[#This Row],[Enrolled]]=1,\"No first service\",IF(Table1[[#This Row],[Expressed interest]]=1,\"Not enrolled\",IF(Table1[[#This Row],[Eligible]]=1,\"Not interested\",IF(Table1[[#This Row],[Contacted]]=1,\"Not eligible\",IF(Table1[[#This Row],[Identified]]=1,\"Not contacted\",\"\"))))))","v":"Not eligible"},{"$f":"_xlfn.CONCAT(Table1[[#This Row],[Reason not contacted]],Table1[[#This Row],[Reason not eligible]],Table1[[#This Row],[Reason not interested]],Table1[[#This Row],[Reason not enrolled]],Table1[[#This Row],[Reason first service not received]])","v":"Ineligible reason1"}]
[1333,null,"25 to 44 yrs","F","Non-Hispanic/Latino","Black or African-American","Yes","Yes","No","Not Employed","0 to 1","Other","Work related","Non-workers comp","Industry 2","Occupation 1","Employer","Electronic Health Records","County B","Phone",1,1,null,1,null,0,"Impact on provider relationship",0,null,0,null,"2019-07-02","2019-07-07","2019-08-11",null,null,{"$f":"IF(Table1[[#This Row],[First service received]]=1,\"Never dropped\",IF(Table1[[#This Row],[Enrolled]]=1,\"No first service\",IF(Table1[[#This Row],[Expressed interest]]=1,\"Not enrolled\",IF(Table1[[#This Row],[Eligible]]=1,\"Not interested\",IF(Table1[[#This Row],[Contacted]]=1,\"Not eligible\",IF(Table1[[#This Row],[Identified]]=1,\"Not contacted\",\"\"))))))","v":"Not interested"},{"$f":"_xlfn.CONCAT(Table1[[#This Row],[Reason not contacted]],Table1[[#This Row],[Reason not eligible]],Table1[[#This Row],[Reason not interested]],Table1[[#This Row],[Reason not enrolled]],Table1[[#This Row],[Reason first service not received]])","v":"Impact on provider relationship"}]
[1339,null,"45 to 64 yrs","M","Non-Hispanic/Latino","American Indian or Alaska Native","Yes","Yes","No","Employed","2 to 6","MSK","Non-work related","Non-workers comp","Industry 3","Occupation 1","Health provider","Worker’s comp database","County B","Email",1,1,null,1,null,1,null,1,null,1,null,"2019-07-02","2019-07-17","2019-07-20","2019-08-07","2019-08-16",{"$f":"IF(Table1[[#This Row],[First service received]]=1,\"Never dropped\",IF(Table1[[#This Row],[Enrolled]]=1,\"No first service\",IF(Table1[[#This Row],[Expressed interest]]=1,\"Not enrolled\",IF(Table1[[#This Row],[Eligible]]=1,\"Not interested\",IF(Table1[[#This Row],[Contacted]]=1,\"Not eligible\",IF(Table1[[#This Row],[Identified]]=1,\"Not contacted\",\"\"))))))","v":"Never dropped"},{"$f":"_xlfn.CONCAT(Table1[[#This Row],[Reason not contacted]],Table1[[#This Row],[Reason not eligible]],Table1[[#This Row],[Reason not interested]],Table1[[#This Row],[Reason not enrolled]],Table1[[#This Row],[Reason first service not received]])","v":""}]
[1393,null,"65 yrs +","M","Non-Hispanic/Latino","White","Yes","Yes","No","Employed","7 to 12","Cardio or Respiratory","Work related","Non-workers comp","Industry 3","Occupation 3","Health provider","Voc rehab centers","County C","In person",1,1,null,1,null,1,null,1,null,1,null,"2019-07-02","2019-07-09","2019-07-09","2019-07-26","2019-08-04",{"$f":"IF(Table1[[#This Row],[First service received]]=1,\"Never dropped\",IF(Table1[[#This Row],[Enrolled]]=1,\"No first service\",IF(Table1[[#This Row],[Expressed interest]]=1,\"Not enrolled\",IF(Table1[[#This Row],[Eligible]]=1,\"Not interested\",IF(Table1[[#This Row],[Contacted]]=1,\"Not eligible\",IF(Table1[[#This Row],[Identified]]=1,\"Not contacted\",\"\"))))))","v":"Never dropped"},{"$f":"_xlfn.CONCAT(Table1[[#This Row],[Reason not contacted]],Table1[[#This Row],[Reason not eligible]],Table1[[#This Row],[Reason not interested]],Table1[[#This Row],[Reason not enrolled]],Table1[[#This Row],[Reason first service not received]])","v":""}]
[1553,null,"25 to 44 yrs","F","Non-Hispanic/Latino","White","Yes","Yes","No","Employed","2 to 6","MSK","Non-work related","Non-workers comp","Industry 3","Occupation 2","Health provider","FMLA forms","County B","Other",1,0,"Inaccurate contact info",0,null,0,null,0,null,0,null,"2019-07-02",null,null,null,null,{"$f":"IF(Table1[[#This Row],[First service received]]=1,\"Never dropped\",IF(Table1[[#This Row],[Enrolled]]=1,\"No first service\",IF(Table1[[#This Row],[Expressed interest]]=1,\"Not enrolled\",IF(Table1[[#This Row],[Eligible]]=1,\"Not interested\",IF(Table1[[#This Row],[Contacted]]=1,\"Not eligible\",IF(Table1[[#This Row],[Identified]]=1,\"Not contacted\",\"\"))))))","v":"Not contacted"},{"$f":"_xlfn.CONCAT(Table1[[#This Row],[Reason not contacted]],Table1[[#This Row],[Reason not eligible]],Table1[[#This Row],[Reason not interested]],Table1[[#This Row],[Reason not enrolled]],Table1[[#This Row],[Reason first service not received]])","v":"Inaccurate contact info"}]
[1561,null,"45 to 64 yrs","F","Non-Hispanic/Latino","White","Yes","Yes","No","Employed","7 to 12","MSK","Non-work related","Non-workers comp","Industry 3","Occupation 2","Health provider","Worker’s comp database","County B","In person",1,1,null,1,null,1,null,1,null,0,"Health problems","2019-07-02","2019-07-06","2019-07-14","2019-07-23",null,{"$f":"IF(Table1[[#This Row],[First service received]]=1,\"Never dropped\",IF(Table1[[#This Row],[Enrolled]]=1,\"No first service\",IF(Table1[[#This Row],[Expressed interest]]=1,\"Not enrolled\",IF(Table1[[#This Row],[Eligible]]=1,\"Not interested\",IF(Table1[[#This Row],[Contacted]]=1,\"Not eligible\",IF(Table1[[#This Row],[Identified]]=1,\"Not contacted\",\"\"))))))","v":"No first service"},{"$f":"_xlfn.CONCAT(Table1[[#This Row],[Reason not contacted]],Table1[[#This Row],[Reason not eligible]],Table1[[#This Row],[Reason not interested]],Table1[[#This Row],[Reason not enrolled]],Table1[[#This Row],[Reason first service not received]])","v":"Health problems"}]
[1091,null,"45 to 64 yrs","F","Non-Hispanic/Latino","Black or African-American","Yes","Yes","No","Self-employed","13+ weeks","MSK","Non-work related","Non-workers comp","Industry 3","Occupation 2","Health provider","Worker’s comp database","County A","Email",1,1,null,0,"Ineligible reason1",0,null,0,null,0,null,"2019-07-03","2019-07-17","2019-07-26",null,null,{"$f":"IF(Table1[[#This Row],[First service received]]=1,\"Never dropped\",IF(Table1[[#This Row],[Enrolled]]=1,\"No first service\",IF(Table1[[#This Row],[Expressed interest]]=1,\"Not enrolled\",IF(Table1[[#This Row],[Eligible]]=1,\"Not interested\",IF(Table1[[#This Row],[Contacted]]=1,\"Not eligible\",IF(Table1[[#This Row],[Identified]]=1,\"Not contacted\",\"\"))))))","v":"Not eligible"},{"$f":"_xlfn.CONCAT(Table1[[#This Row],[Reason not contacted]],Table1[[#This Row],[Reason not eligible]],Table1[[#This Row],[Reason not interested]],Table1[[#This Row],[Reason not enrolled]],Table1[[#This Row],[Reason first service not received]])","v":"Ineligible reason1"}]
[1330,null,"45 to 64 yrs","M","Non-Hispanic/Latino","White","No","Yes","No","Employed","7 to 12","Other","Non-work related","Non-workers comp","Industry 3","Occupation 3","Health provider","FMLA forms","County B","Phone",1,1,null,1,null,1,null,1,null,0,"Health problems","2019-07-03","2019-07-09","2019-07-19","2019-08-08",null,{"$f":"IF(Table1[[#This Row],[First service received]]=1,\"Never dropped\",IF(Table1[[#This Row],[Enrolled]]=1,\"No first service\",IF(Table1[[#This Row],[Expressed interest]]=1,\"Not enrolled\",IF(Table1[[#This Row],[Eligible]]=1,\"Not interested\",IF(Table1[[#This Row],[Contacted]]=1,\"Not eligible\",IF(Table1[[#This Row],[Identified]]=1,\"Not contacted\",\"\"))))))","v":"No first service"},{"$f":"_xlfn.CONCAT(Table1[[#This Row],[Reason not contacted]],Table1[[#This Row],[Reason not eligible]],Table1[[#This Row],[Reason not interested]],Table1[[#This Row],[Reason not enrolled]],Table1[[#This Row],[Reason first service not received]])","v":"Health problems"}]
[1429,null,"45 to 64 yrs","F","Non-Hispanic/Latino","White","No","Yes","No","Employed","7 to 12","MSK","Work related","Workers comp","Industry 4","Occupation 3","Health provider","FMLA forms","County B","Phone",1,0,"Inaccurate contact info",0,null,0,null,0,null,0,null,"2019-07-03",null,null,null,null,{"$f":"IF(Table1[[#This Row],[First service received]]=1,\"Never dropped\",IF(Table1[[#This Row],[Enrolled]]=1,\"No first service\",IF(Table1[[#This Row],[Expressed interest]]=1,\"Not enrolled\",IF(Table1[[#This Row],[Eligible]]=1,\"Not interested\",IF(Table1[[#This Row],[Contacted]]=1,\"Not eligible\",IF(Table1[[#This Row],[Identified]]=1,\"Not contacted\",\"\"))))))","v":"Not contacted"},{"$f":"_xlfn.CONCAT(Table1[[#This Row],[Reason not contacted]],Table1[[#This Row],[Reason not eligible]],Table1[[#This Row],[Reason not interested]],Table1[[#This Row],[Reason not enrolled]],Table1[[#This Row],[Reason first service not received]])","v":"Inaccurate contact info"}]
[1460,null,"25 to 44 yrs","M","Non-Hispanic/Latino","Black or African-American","No","Yes","No","Employed","13+ weeks","MSK","Non-work related","Non-workers comp","Industry 3","Occupation 2","Health provider","Worker’s comp database","County B","Email",1,1,null,0,"Ineligible reason3",0,null,0,null,0,null,"2019-07-03","2019-07-14","2019-08-22",null,null,{"$f":"IF(Table1[[#This Row],[First service received]]=1,\"Never dropped\",IF(Table1[[#This Row],[Enrolled]]=1,\"No first service\",IF(Table1[[#This Row],[Expressed interest]]=1,\"Not enrolled\",IF(Table1[[#This Row],[Eligible]]=1,\"Not interested\",IF(Table1[[#This Row],[Contacted]]=1,\"Not eligible\",IF(Table1[[#This Row],[Identified]]=1,\"Not contacted\",\"\"))))))","v":"Not eligible"},{"$f":"_xlfn.CONCAT(Table1[[#This Row],[Reason not contacted]],Table1[[#This Row],[Reason not eligible]],Table1[[#This Row],[Reason not interested]],Table1[[#This Row],[Reason not enrolled]],Table1[[#This Row],[Reason first service not received]])","v":"Ineligible reason3"}]
[1585,null,"25 to 44 yrs","M","Hispanic/Latino","White","Yes","Yes","No","Employed","7 to 12","Other","Work related","Non-workers comp","Industry 1","Occupation 1","Workforce partner","Electronic Health Records","County C","Other",1,0,"Inaccurate contact info",0,null,0,null,0,null,0,null,"2019-07-03",null,null,null,null,{"$f":"IF(Table1[[#This Row],[First service received]]=1,\"Never dropped\",IF(Table1[[#This Row],[Enrolled]]=1,\"No first service\",IF(Table1[[#This Row],[Expressed interest]]=1,\"Not enrolled\",IF(Table1[[#This Row],[Eligible]]=1,\"Not interested\",IF(Table1[[#This Row],[Contacted]]=1,\"Not eligible\",IF(Table1[[#This Row],[Identified]]=1,\"Not contacted\",\"\"))))))","v":"Not contacted"},{"$f":"_xlfn.CONCAT(Table1[[#This Row],[Reason not contacted]],Table1[[#This Row],[Reason not eligible]],Table1[[#This Row],[Reason not interested]],Table1[[#This Row],[Reason not enrolled]],Table1[[#This Row],[Reason first service not received]])","v":"Inaccurate contact info"}]
[1601,null,"65 yrs +","M","Non-Hispanic/Latino","White","Yes","Yes","No","Employed","2 to 6","MSK","Work related","Workers comp","Industry 1","Occupation 3","Health provider","Clinic appointment schedules","County A","Phone",1,1,null,1,null,1,null,0,"Circumstances changed",0,null,"2019-07-03","2019-07-08","2019-07-20",null,null,{"$f":"IF(Table1[[#This Row],[First service received]]=1,\"Never dropped\",IF(Table1[[#This Row],[Enrolled]]=1,\"No first service\",IF(Table1[[#This Row],[Expressed interest]]=1,\"Not enrolled\",IF(Table1[[#This Row],[Eligible]]=1,\"Not interested\",IF(Table1[[#This Row],[Contacted]]=1,\"Not eligible\",IF(Table1[[#This Row],[Identified]]=1,\"Not contacted\",\"\"))))))","v":"Not enrolled"},{"$f":"_xlfn.CONCAT(Table1[[#This Row],[Reason not contacted]],Table1[[#This Row],[Reason not eligible]],Table1[[#This Row],[Reason not interested]],Table1[[#This Row],[Reason not enrolled]],Table1[[#This Row],[Reason first service not received]])","v":"Circumstances changed"}]
[1623,null,"45 to 64 yrs","F","Hispanic/Latino","White","Yes","Yes","No","Employed","7 to 12","Other","Non-work related","Non-workers comp","Industry 3","Occupation 2","Employer","Electronic Health Records","County B","Phone",1,1,null,0,"Ineligible reason1",0,null,0,null,0,null,"2019-07-03","2019-07-10","2019-08-16",null,null,{"$f":"IF(Table1[[#This Row],[First service received]]=1,\"Never dropped\",IF(Table1[[#This Row],[Enrolled]]=1,\"No first service\",IF(Table1[[#This Row],[Expressed interest]]=1,\"Not enrolled\",IF(Table1[[#This Row],[Eligible]]=1,\"Not interested\",IF(Table1[[#This Row],[Contacted]]=1,\"Not eligible\",IF(Table1[[#This Row],[Identified]]=1,\"Not contacted\",\"\"))))))","v":"Not eligible"},{"$f":"_xlfn.CONCAT(Table1[[#This Row],[Reason not contacted]],Table1[[#This Row],[Reason not eligible]],Table1[[#This Row],[Reason not interested]],Table1[[#This Row],[Reason not enrolled]],Table1[[#This Row],[Reason first service not received]])","v":"Ineligible reason1"}]
[1037,null,"25 to 44 yrs","M","Non-Hispanic/Latino","White","No","Yes","No","Self-employed","13+ weeks","MSK","Non-work related","Non-workers comp","Industry 3","Occupation 1","Health provider","Worker’s comp database","County B","Email",1,1,null,1,null,0,"Don't want to be in research study",0,null,0,null,"2019-07-04","2019-07-16","2019-08-12",null,null,{"$f":"IF(Table1[[#This Row],[First service received]]=1,\"Never dropped\",IF(Table1[[#This Row],[Enrolled]]=1,\"No first service\",IF(Table1[[#This Row],[Expressed interest]]=1,\"Not enrolled\",IF(Table1[[#This Row],[Eligible]]=1,\"Not interested\",IF(Table1[[#This Row],[Contacted]]=1,\"Not eligible\",IF(Table1[[#This Row],[Identified]]=1,\"Not contacted\",\"\"))))))","v":"Not interested"},{"$f":"_xlfn.CONCAT(Table1[[#This Row],[Reason not contacted]],Table1[[#This Row],[Reason not eligible]],Table1[[#This Row],[Reason not interested]],Table1[[#This Row],[Reason not enrolled]],Table1[[#This Row],[Reason first service not received]])","v":"Don't want to be in research study"}]
[1098,null,"45 to 64 yrs","M","Non-Hispanic/Latino","Other or 2 or more","Yes","Yes","No","Not Employed","0 to 1","Other","Non-work related","Non-workers comp","Industry 2","Occupation 3","Health provider","FMLA forms","County B","Phone",1,1,null,1,null,1,null,1,null,1,null,"2019-07-04","2019-07-14","2019-07-14","2019-07-30","2019-08-09",{"$f":"IF(Table1[[#This Row],[First service received]]=1,\"Never dropped\",IF(Table1[[#This Row],[Enrolled]]=1,\"No first service\",IF(Table1[[#This Row],[Expressed interest]]=1,\"Not enrolled\",IF(Table1[[#This Row],[Eligible]]=1,\"Not interested\",IF(Table1[[#This Row],[Contacted]]=1,\"Not eligible\",IF(Table1[[#This Row],[Identified]]=1,\"Not contacted\",\"\"))))))","v":"Never dropped"},{"$f":"_xlfn.CONCAT(Table1[[#This Row],[Reason not contacted]],Table1[[#This Row],[Reason not eligible]],Table1[[#This Row],[Reason not interested]],Table1[[#This Row],[Reason not enrolled]],Table1[[#This Row],[Reason first service not received]])","v":""}]
[1105,null,"25 to 44 yrs","M","Non-Hispanic/Latino","Black or African-American","Yes","Yes","No","Employed","7 to 12","Other","Non-work related","Non-workers comp","Industry 1","Occupation 1","Employer","Electronic Health Records","County B","Other",1,0,"No contact info",0,null,0,null,0,null,0,null,"2019-07-04",null,null,null,null,{"$f":"IF(Table1[[#This Row],[First service received]]=1,\"Never dropped\",IF(Table1[[#This Row],[Enrolled]]=1,\"No first service\",IF(Table1[[#This Row],[Expressed interest]]=1,\"Not enrolled\",IF(Table1[[#This Row],[Eligible]]=1,\"Not interested\",IF(Table1[[#This Row],[Contacted]]=1,\"Not eligible\",IF(Table1[[#This Row],[Identified]]=1,\"Not contacted\",\"\"))))))","v":"Not contacted"},{"$f":"_xlfn.CONCAT(Table1[[#This Row],[Reason not contacted]],Table1[[#This Row],[Reason not eligible]],Table1[[#This Row],[Reason not interested]],Table1[[#This Row],[Reason not enrolled]],Table1[[#This Row],[Reason first service not received]])","v":"No contact info"}]
[1193,null,"45 to 64 yrs","F","Non-Hispanic/Latino","White","No","No","No","Employed","2 to 6","MSK","Non-work related","Non-workers comp","Industry 2","Occupation 3","Workforce partner","Electronic Health Records","County B","Phone",1,1,null,0,"Ineligible reason2",0,null,0,null,0,null,"2019-07-04","2019-07-19","2019-08-31",null,null,{"$f":"IF(Table1[[#This Row],[First service received]]=1,\"Never dropped\",IF(Table1[[#This Row],[Enrolled]]=1,\"No first service\",IF(Table1[[#This Row],[Expressed interest]]=1,\"Not enrolled\",IF(Table1[[#This Row],[Eligible]]=1,\"Not interested\",IF(Table1[[#This Row],[Contacted]]=1,\"Not eligible\",IF(Table1[[#This Row],[Identified]]=1,\"Not contacted\",\"\"))))))","v":"Not eligible"},{"$f":"_xlfn.CONCAT(Table1[[#This Row],[Reason not contacted]],Table1[[#This Row],[Reason not eligible]],Table1[[#This Row],[Reason not interested]],Table1[[#This Row],[Reason not enrolled]],Table1[[#This Row],[Reason first service not received]])","v":"Ineligible reason2"}]
[1262,null,"25 to 44 yrs","F","Non-Hispanic/Latino","White","No","Yes","No","Employed","13+ weeks","MSK","Non-work related","Non-workers comp","Industry 4","Occupation 3","Health provider","Worker’s comp database","County B","Email",1,1,null,0,"Ineligible reason1",0,null,0,null,0,null,"2019-07-04","2019-07-15","2019-08-04",null,null,{"$f":"IF(Table1[[#This Row],[First service received]]=1,\"Never dropped\",IF(Table1[[#This Row],[Enrolled]]=1,\"No first service\",IF(Table1[[#This Row],[Expressed interest]]=1,\"Not enrolled\",IF(Table1[[#This Row],[Eligible]]=1,\"Not interested\",IF(Table1[[#This Row],[Contacted]]=1,\"Not eligible\",IF(Table1[[#This Row],[Identified]]=1,\"Not contacted\",\"\"))))))","v":"Not eligible"},{"$f":"_xlfn.CONCAT(Table1[[#This Row],[Reason not contacted]],Table1[[#This Row],[Reason not eligible]],Table1[[#This Row],[Reason not interested]],Table1[[#This Row],[Reason not enrolled]],Table1[[#This Row],[Reason first service not received]])","v":"Ineligible reason1"}]
[1604,null,"45 to 64 yrs","F","Non-Hispanic/Latino","Black or African-American","Yes","Yes","No","Employed","7 to 12","MSK","Non-work related","Non-workers comp","Industry 1","Occupation 3","Health provider","Work restriction forms","County B","Phone",1,1,null,0,"Ineligible reason1",0,null,0,null,0,null,"2019-07-04","2019-07-13","2019-07-30",null,null,{"$f":"IF(Table1[[#This Row],[First service received]]=1,\"Never dropped\",IF(Table1[[#This Row],[Enrolled]]=1,\"No first service\",IF(Table1[[#This Row],[Expressed interest]]=1,\"Not enrolled\",IF(Table1[[#This Row],[Eligible]]=1,\"Not interested\",IF(Table1[[#This Row],[Contacted]]=1,\"Not eligible\",IF(Table1[[#This Row],[Identified]]=1,\"Not contacted\",\"\"))))))","v":"Not eligible"},{"$f":"_xlfn.CONCAT(Table1[[#This Row],[Reason not contacted]],Table1[[#This Row],[Reason not eligible]],Table1[[#This Row],[Reason not interested]],Table1[[#This Row],[Reason not enrolled]],Table1[[#This Row],[Reason first service not received]])","v":"Ineligible reason1"}]
[1243,null,"25 to 44 yrs","F","Non-Hispanic/Latino","White","Yes","Yes","No","Employed","2 to 6","MSK","Non-work related","Non-workers comp","Industry 3","Occupation 2","Health provider","Work restriction forms","County B","Phone",1,1,null,0,"Ineligible reason1",0,null,0,null,0,null,"2019-07-05","2019-07-20","2019-08-03",null,null,{"$f":"IF(Table1[[#This Row],[First service received]]=1,\"Never dropped\",IF(Table1[[#This Row],[Enrolled]]=1,\"No first service\",IF(Table1[[#This Row],[Expressed interest]]=1,\"Not enrolled\",IF(Table1[[#This Row],[Eligible]]=1,\"Not interested\",IF(Table1[[#This Row],[Contacted]]=1,\"Not eligible\",IF(Table1[[#This Row],[Identified]]=1,\"Not contacted\",\"\"))))))","v":"Not eligible"},{"$f":"_xlfn.CONCAT(Table1[[#This Row],[Reason not contacted]],Table1[[#This Row],[Reason not eligible]],Table1[[#This Row],[Reason not interested]],Table1[[#This Row],[Reason not enrolled]],Table1[[#This Row],[Reason first service not received]])","v":"Ineligible reason1"}]
[1244,null,"25 to 44 yrs","M","Non-Hispanic/Latino","White","No","Yes","No","Employed","2 to 6","MSK","Non-work related","Non-workers comp","Industry 1","Occupation 3","Health provider","Worker’s comp database","County B","In person",1,0,"Contacted, no response",0,null,0,null,0,null,0,null,"2019-07-05",null,null,null,null,{"$f":"IF(Table1[[#This Row],[First service received]]=1,\"Never dropped\",IF(Table1[[#This Row],[Enrolled]]=1,\"No first service\",IF(Table1[[#This Row],[Expressed interest]]=1,\"Not enrolled\",IF(Table1[[#This Row],[Eligible]]=1,\"Not interested\",IF(Table1[[#This Row],[Contacted]]=1,\"Not eligible\",IF(Table1[[#This Row],[Identified]]=1,\"Not contacted\",\"\"))))))","v":"Not contacted"},{"$f":"_xlfn.CONCAT(Table1[[#This Row],[Reason not contacted]],Table1[[#This Row],[Reason not eligible]],Table1[[#This Row],[Reason not interested]],Table1[[#This Row],[Reason not enrolled]],Table1[[#This Row],[Reason first service not received]])","v":"Contacted, no response"}]
[1051,null,"25 to 44 yrs","F","Non-Hispanic/Latino","Black or African-American","Yes","Yes","No","Employed","7 to 12","MSK","Non-work related","Non-workers comp","Industry 1","Occupation 3","Employer","Electronic Health Records","County B","In person",1,1,null,0,"Ineligible reason3",0,null,0,null,0,null,"2019-07-06","2019-07-14","2019-08-05",null,null,{"$f":"IF(Table1[[#This Row],[First service received]]=1,\"Never dropped\",IF(Table1[[#This Row],[Enrolled]]=1,\"No first service\",IF(Table1[[#This Row],[Expressed interest]]=1,\"Not enrolled\",IF(Table1[[#This Row],[Eligible]]=1,\"Not interested\",IF(Table1[[#This Row],[Contacted]]=1,\"Not eligible\",IF(Table1[[#This Row],[Identified]]=1,\"Not contacted\",\"\"))))))","v":"Not eligible"},{"$f":"_xlfn.CONCAT(Table1[[#This Row],[Reason not contacted]],Table1[[#This Row],[Reason not eligible]],Table1[[#This Row],[Reason not interested]],Table1[[#This Row],[Reason not enrolled]],Table1[[#This Row],[Reason first service not received]])","v":"Ineligible reason3"}]
[1256,null,"25 to 44 yrs","F","Non-Hispanic/Latino","White","No","Yes","No","Employed","0 to 1","MSK","Non-work related","Non-workers comp","Industry 3","Occupation 2","Health provider","Worker’s comp database","County B","Phone",1,1,null,1,null,1,null,1,null,0,"Returned to work","2019-07-06","2019-07-12","2019-07-14","2019-07-28",null,{"$f":"IF(Table1[[#This Row],[First service received]]=1,\"Never dropped\",IF(Table1[[#This Row],[Enrolled]]=1,\"No first service\",IF(Table1[[#This Row],[Expressed interest]]=1,\"Not enrolled\",IF(Table1[[#This Row],[Eligible]]=1,\"Not interested\",IF(Table1[[#This Row],[Contacted]]=1,\"Not eligible\",IF(Table1[[#This Row],[Identified]]=1,\"Not contacted\",\"\"))))))","v":"No first service"},{"$f":"_xlfn.CONCAT(Table1[[#This Row],[Reason not contacted]],Table1[[#This Row],[Reason not eligible]],Table1[[#This Row],[Reason not interested]],Table1[[#This Row],[Reason not enrolled]],Table1[[#This Row],[Reason first service not received]])","v":"Returned to work"}]
[1325,null,"25 to 44 yrs","F","Non-Hispanic/Latino","Other or 2 or more","Yes","Yes","No","Employed","13+ weeks","MSK","Non-work related","Non-workers comp","Industry 1","Occupation 3","Workforce partner","Electronic Health Records","County B","Phone",1,1,null,1,null,0,"Impact on provider relationship",0,null,0,null,"2019-07-06","2019-07-11","2019-08-10",null,null,{"$f":"IF(Table1[[#This Row],[First service received]]=1,\"Never dropped\",IF(Table1[[#This Row],[Enrolled]]=1,\"No first service\",IF(Table1[[#This Row],[Expressed interest]]=1,\"Not enrolled\",IF(Table1[[#This Row],[Eligible]]=1,\"Not interested\",IF(Table1[[#This Row],[Contacted]]=1,\"Not eligible\",IF(Table1[[#This Row],[Identified]]=1,\"Not contacted\",\"\"))))))","v":"Not interested"},{"$f":"_xlfn.CONCAT(Table1[[#This Row],[Reason not contacted]],Table1[[#This Row],[Reason not eligible]],Table1[[#This Row],[Reason not interested]],Table1[[#This Row],[Reason not enrolled]],Table1[[#This Row],[Reason first service not received]])","v":"Impact on provider relationship"}]
[1589,null,"25 to 44 yrs","M","Non-Hispanic/Latino","White","Yes","Yes","No","Employed","7 to 12","MSK","Non-work related","Non-workers comp","Industry 3","Occupation 3","Health provider","Work restriction forms","County A","Email",1,1,null,0,"Ineligible reason1",0,null,0,null,0,null,"2019-07-06","2019-07-11","2019-08-06",null,null,{"$f":"IF(Table1[[#This Row],[First service received]]=1,\"Never dropped\",IF(Table1[[#This Row],[Enrolled]]=1,\"No first service\",IF(Table1[[#This Row],[Expressed interest]]=1,\"Not enrolled\",IF(Table1[[#This Row],[Eligible]]=1,\"Not interested\",IF(Table1[[#This Row],[Contacted]]=1,\"Not eligible\",IF(Table1[[#This Row],[Identified]]=1,\"Not contacted\",\"\"))))))","v":"Not eligible"},{"$f":"_xlfn.CONCAT(Table1[[#This Row],[Reason not contacted]],Table1[[#This Row],[Reason not eligible]],Table1[[#This Row],[Reason not interested]],Table1[[#This Row],[Reason not enrolled]],Table1[[#This Row],[Reason first service not received]])","v":"Ineligible reason1"}]
[1128,null,"45 to 64 yrs","M","Non-Hispanic/Latino","White","Yes","Yes","No","Not Employed","0 to 1","Other","Non-work related","Non-workers comp","Industry 3","Occupation 2","Health provider","Worker’s comp database","County B","In person",1,1,null,1,null,0,"Don't want to be in research study",0,null,0,null,"2019-07-07","2019-07-21","2019-08-25",null,null,{"$f":"IF(Table1[[#This Row],[First service received]]=1,\"Never dropped\",IF(Table1[[#This Row],[Enrolled]]=1,\"No first service\",IF(Table1[[#This Row],[Expressed interest]]=1,\"Not enrolled\",IF(Table1[[#This Row],[Eligible]]=1,\"Not interested\",IF(Table1[[#This Row],[Contacted]]=1,\"Not eligible\",IF(Table1[[#This Row],[Identified]]=1,\"Not contacted\",\"\"))))))","v":"Not interested"},{"$f":"_xlfn.CONCAT(Table1[[#This Row],[Reason not contacted]],Table1[[#This Row],[Reason not eligible]],Table1[[#This Row],[Reason not interested]],Table1[[#This Row],[Reason not enrolled]],Table1[[#This Row],[Reason first service not received]])","v":"Don't want to be in research study"}]
[1164,null,"25 to 44 yrs","F","Hispanic/Latino","White","Yes","Yes","No","Employed","7 to 12","MSK","Non-work related","Non-workers comp","Industry 3","Occupation 2","Health provider","Work restriction forms","County A","Phone",1,0,"No contact info",0,null,0,null,0,null,0,null,"2019-07-07",null,null,null,null,{"$f":"IF(Table1[[#This Row],[First service received]]=1,\"Never dropped\",IF(Table1[[#This Row],[Enrolled]]=1,\"No first service\",IF(Table1[[#This Row],[Expressed interest]]=1,\"Not enrolled\",IF(Table1[[#This Row],[Eligible]]=1,\"Not interested\",IF(Table1[[#This Row],[Contacted]]=1,\"Not eligible\",IF(Table1[[#This Row],[Identified]]=1,\"Not contacted\",\"\"))))))","v":"Not contacted"},{"$f":"_xlfn.CONCAT(Table1[[#This Row],[Reason not contacted]],Table1[[#This Row],[Reason not eligible]],Table1[[#This Row],[Reason not interested]],Table1[[#This Row],[Reason not enrolled]],Table1[[#This Row],[Reason first service not received]])","v":"No contact info"}]
[1213,null,"18 to 24 yrs","M","Non-Hispanic/Latino","White","Yes","Yes","No","Employed","7 to 12","MSK","Work related","Workers comp","Industry 3","Occupation 3","Self","Electronic Health Records","County B","Phone",1,1,null,1,null,1,null,1,null,1,null,"2019-07-07","2019-07-21","2019-07-24","2019-08-17","2019-08-28",{"$f":"IF(Table1[[#This Row],[First service received]]=1,\"Never dropped\",IF(Table1[[#This Row],[Enrolled]]=1,\"No first service\",IF(Table1[[#This Row],[Expressed interest]]=1,\"Not enrolled\",IF(Table1[[#This Row],[Eligible]]=1,\"Not interested\",IF(Table1[[#This Row],[Contacted]]=1,\"Not eligible\",IF(Table1[[#This Row],[Identified]]=1,\"Not contacted\",\"\"))))))","v":"Never dropped"},{"$f":"_xlfn.CONCAT(Table1[[#This Row],[Reason not contacted]],Table1[[#This Row],[Reason not eligible]],Table1[[#This Row],[Reason not interested]],Table1[[#This Row],[Reason not enrolled]],Table1[[#This Row],[Reason first service not received]])","v":""}]
[1388,null,"65 yrs +","M","Non-Hispanic/Latino","Black or African-American","Yes","Yes","No","Employed","7 to 12","MSK","Work related","Workers comp","Industry 3","Occupation 3","Health provider","Worker’s comp database","County C","In person",1,1,null,1,null,0,"Don't want to be in research study",0,null,0,null,"2019-07-07","2019-07-11","2019-07-20",null,null,{"$f":"IF(Table1[[#This Row],[First service received]]=1,\"Never dropped\",IF(Table1[[#This Row],[Enrolled]]=1,\"No first service\",IF(Table1[[#This Row],[Expressed interest]]=1,\"Not enrolled\",IF(Table1[[#This Row],[Eligible]]=1,\"Not interested\",IF(Table1[[#This Row],[Contacted]]=1,\"Not eligible\",IF(Table1[[#This Row],[Identified]]=1,\"Not contacted\",\"\"))))))","v":"Not interested"},{"$f":"_xlfn.CONCAT(Table1[[#This Row],[Reason not contacted]],Table1[[#This Row],[Reason not eligible]],Table1[[#This Row],[Reason not interested]],Table1[[#This Row],[Reason not enrolled]],Table1[[#This Row],[Reason first service not received]])","v":"Don't want to be in research study"}]
[1425,null,"25 to 44 yrs","F","Non-Hispanic/Latino","American Indian or Alaska Native","Yes","Yes","No","Employed","2 to 6","MSK","Non-work related","Non-workers comp","Industry 3","Occupation 2","Health provider","Work restriction forms","County B","Phone",1,1,null,1,null,1,null,1,null,1,null,"2019-07-07","2019-07-15","2019-07-21","2019-08-02","2019-08-05",{"$f":"IF(Table1[[#This Row],[First service received]]=1,\"Never dropped\",IF(Table1[[#This Row],[Enrolled]]=1,\"No first service\",IF(Table1[[#This Row],[Expressed interest]]=1,\"Not enrolled\",IF(Table1[[#This Row],[Eligible]]=1,\"Not interested\",IF(Table1[[#This Row],[Contacted]]=1,\"Not eligible\",IF(Table1[[#This Row],[Identified]]=1,\"Not contacted\",\"\"))))))","v":"Never dropped"},{"$f":"_xlfn.CONCAT(Table1[[#This Row],[Reason not contacted]],Table1[[#This Row],[Reason not eligible]],Table1[[#This Row],[Reason not interested]],Table1[[#This Row],[Reason not enrolled]],Table1[[#This Row],[Reason first service not received]])","v":""}]
[1003,null,"25 to 44 yrs","F","Non-Hispanic/Latino","White","Yes","Yes","No","Employed","7 to 12","MSK","Work related","Non-workers comp","Industry 3","Occupation 3","Health provider","Clinic appointment schedules","County A","Email",1,1,null,1,null,0,"Impact on provider relationship",0,null,0,null,"2019-07-08","2019-07-10","2019-08-05",null,null,{"$f":"IF(Table1[[#This Row],[First service received]]=1,\"Never dropped\",IF(Table1[[#This Row],[Enrolled]]=1,\"No first service\",IF(Table1[[#This Row],[Expressed interest]]=1,\"Not enrolled\",IF(Table1[[#This Row],[Eligible]]=1,\"Not interested\",IF(Table1[[#This Row],[Contacted]]=1,\"Not eligible\",IF(Table1[[#This Row],[Identified]]=1,\"Not contacted\",\"\"))))))","v":"Not interested"},{"$f":"_xlfn.CONCAT(Table1[[#This Row],[Reason not contacted]],Table1[[#This Row],[Reason not eligible]],Table1[[#This Row],[Reason not interested]],Table1[[#This Row],[Reason not enrolled]],Table1[[#This Row],[Reason first service not received]])","v":"Impact on provider relationship"}]
[1031,null,"45 to 64 yrs","M","Non-Hispanic/Latino","Black or African-American","Yes","Yes","No","Not Employed","0 to 1","Other","Non-work related","Non-workers comp","Industry 4","Occupation 1","Self","Electronic Health Records","County B","Email",1,1,null,1,null,0,"Don't want to be in research study",0,null,0,null,"2019-07-08","2019-07-12","2019-08-16",null,null,{"$f":"IF(Table1[[#This Row],[First service received]]=1,\"Never dropped\",IF(Table1[[#This Row],[Enrolled]]=1,\"No first service\",IF(Table1[[#This Row],[Expressed interest]]=1,\"Not enrolled\",IF(Table1[[#This Row],[Eligible]]=1,\"Not interested\",IF(Table1[[#This Row],[Contacted]]=1,\"Not eligible\",IF(Table1[[#This Row],[Identified]]=1,\"Not contacted\",\"\"))))))","v":"Not interested"},{"$f":"_xlfn.CONCAT(Table1[[#This Row],[Reason not contacted]],Table1[[#This Row],[Reason not eligible]],Table1[[#This Row],[Reason not interested]],Table1[[#This Row],[Reason not enrolled]],Table1[[#This Row],[Reason first service not received]])","v":"Don't want to be in research study"}]
[1042,null,"25 to 44 yrs","F","Non-Hispanic/Latino","White","Yes","Yes","No","Employed","7 to 12","MSK","Non-work related","Non-workers comp","Industry 3","Occupation 2","Workforce partner","Electronic Health Records","County B","Email",1,1,null,0,"Ineligible reason1",0,null,0,null,0,null,"2019-07-08","2019-07-23","2019-07-28",null,null,{"$f":"IF(Table1[[#This Row],[First service received]]=1,\"Never dropped\",IF(Table1[[#This Row],[Enrolled]]=1,\"No first service\",IF(Table1[[#This Row],[Expressed interest]]=1,\"Not enrolled\",IF(Table1[[#This Row],[Eligible]]=1,\"Not interested\",IF(Table1[[#This Row],[Contacted]]=1,\"Not eligible\",IF(Table1[[#This Row],[Identified]]=1,\"Not contacted\",\"\"))))))","v":"Not eligible"},{"$f":"_xlfn.CONCAT(Table1[[#This Row],[Reason not contacted]],Table1[[#This Row],[Reason not eligible]],Table1[[#This Row],[Reason not interested]],Table1[[#This Row],[Reason not enrolled]],Table1[[#This Row],[Reason first service not received]])","v":"Ineligible reason1"}]
[1079,null,"25 to 44 yrs","M","Hispanic/Latino","White","Yes","Yes","No","Employed","2 to 6","MSK","Work related","Non-workers comp","Industry 3","Occupation 2","Health provider","Worker’s comp database","County B","Phone",1,1,null,1,null,1,null,1,null,1,null,"2019-07-08","2019-07-11","2019-07-25","2019-07-28","2019-08-11",{"$f":"IF(Table1[[#This Row],[First service received]]=1,\"Never dropped\",IF(Table1[[#This Row],[Enrolled]]=1,\"No first service\",IF(Table1[[#This Row],[Expressed interest]]=1,\"Not enrolled\",IF(Table1[[#This Row],[Eligible]]=1,\"Not interested\",IF(Table1[[#This Row],[Contacted]]=1,\"Not eligible\",IF(Table1[[#This Row],[Identified]]=1,\"Not contacted\",\"\"))))))","v":"Never dropped"},{"$f":"_xlfn.CONCAT(Table1[[#This Row],[Reason not contacted]],Table1[[#This Row],[Reason not eligible]],Table1[[#This Row],[Reason not interested]],Table1[[#This Row],[Reason not enrolled]],Table1[[#This Row],[Reason first service not received]])","v":""}]
[1119,null,"45 to 64 yrs","F","Non-Hispanic/Latino","Black or African-American","No","Yes","No","Self-employed","13+ weeks","Other","Work related","Workers comp","Industry 3","Occupation 3","Health provider","Clinic appointment schedules","County C","In person",1,0,"No contact info",0,null,0,null,0,null,0,null,"2019-07-08",null,null,null,null,{"$f":"IF(Table1[[#This Row],[First service received]]=1,\"Never dropped\",IF(Table1[[#This Row],[Enrolled]]=1,\"No first service\",IF(Table1[[#This Row],[Expressed interest]]=1,\"Not enrolled\",IF(Table1[[#This Row],[Eligible]]=1,\"Not interested\",IF(Table1[[#This Row],[Contacted]]=1,\"Not eligible\",IF(Table1[[#This Row],[Identified]]=1,\"Not contacted\",\"\"))))))","v":"Not contacted"},{"$f":"_xlfn.CONCAT(Table1[[#This Row],[Reason not contacted]],Table1[[#This Row],[Reason not eligible]],Table1[[#This Row],[Reason not interested]],Table1[[#This Row],[Reason not enrolled]],Table1[[#This Row],[Reason first service not received]])","v":"No contact info"}]
[1156,null,"45 to 64 yrs","F","Non-Hispanic/Latino","White","Yes","Yes","No","Employed","13+ weeks","Other","Non-work related","Non-workers comp","Industry 3","Occupation 2","Health provider","Worker’s comp database","County B","In person",1,1,null,1,null,0,"Don't want to be in research study",0,null,0,null,"2019-07-08","2019-07-17","2019-07-19",null,null,{"$f":"IF(Table1[[#This Row],[First service received]]=1,\"Never dropped\",IF(Table1[[#This Row],[Enrolled]]=1,\"No first service\",IF(Table1[[#This Row],[Expressed interest]]=1,\"Not enrolled\",IF(Table1[[#This Row],[Eligible]]=1,\"Not interested\",IF(Table1[[#This Row],[Contacted]]=1,\"Not eligible\",IF(Table1[[#This Row],[Identified]]=1,\"Not contacted\",\"\"))))))","v":"Not interested"},{"$f":"_xlfn.CONCAT(Table1[[#This Row],[Reason not contacted]],Table1[[#This Row],[Reason not eligible]],Table1[[#This Row],[Reason not interested]],Table1[[#This Row],[Reason not enrolled]],Table1[[#This Row],[Reason first service not received]])","v":"Don't want to be in research study"}]
[1186,null,"25 to 44 yrs","F","Hispanic/Latino","White","No","Yes","No","Employed","7 to 12","Other","Non-work related","Non-workers comp","Industry 3","Occupation 2","Self","Electronic Health Records","County B","Phone",1,0,"Contacted, no response",0,null,0,null,0,null,0,null,"2019-07-08",null,null,null,null,{"$f":"IF(Table1[[#This Row],[First service received]]=1,\"Never dropped\",IF(Table1[[#This Row],[Enrolled]]=1,\"No first service\",IF(Table1[[#This Row],[Expressed interest]]=1,\"Not enrolled\",IF(Table1[[#This Row],[Eligible]]=1,\"Not interested\",IF(Table1[[#This Row],[Contacted]]=1,\"Not eligible\",IF(Table1[[#This Row],[Identified]]=1,\"Not contacted\",\"\"))))))","v":"Not contacted"},{"$f":"_xlfn.CONCAT(Table1[[#This Row],[Reason not contacted]],Table1[[#This Row],[Reason not eligible]],Table1[[#This Row],[Reason not interested]],Table1[[#This Row],[Reason not enrolled]],Table1[[#This Row],[Reason first service not received]])","v":"Contacted, no response"}]
[1192,null,"45 to 64 yrs","F","Non-Hispanic/Latino","Black or African-American","Yes","Yes","No","Employed","7 to 12","Other","Non-work related","Non-workers comp","Industry 1","Occupation 3","Health provider","Worker’s comp database","County B","In person",1,1,null,1,null,1,null,1,null,1,null,"2019-07-08","2019-07-16","2019-07-29","2019-08-01","2019-08-14",{"$f":"IF(Table1[[#This Row],[First service received]]=1,\"Never dropped\",IF(Table1[[#This Row],[Enrolled]]=1,\"No first service\",IF(Table1[[#This Row],[Expressed interest]]=1,\"Not enrolled\",IF(Table1[[#This Row],[Eligible]]=1,\"Not interested\",IF(Table1[[#This Row],[Contacted]]=1,\"Not eligible\",IF(Table1[[#This Row],[Identified]]=1,\"Not contacted\",\"\"))))))","v":"Never dropped"},{"$f":"_xlfn.CONCAT(Table1[[#This Row],[Reason not contacted]],Table1[[#This Row],[Reason not eligible]],Table1[[#This Row],[Reason not interested]],Table1[[#This Row],[Reason not enrolled]],Table1[[#This Row],[Reason first service not received]])","v":""}]
[1453,null,"45 to 64 yrs","M","Hispanic/Latino","White","Yes","Yes","No","Employed","2 to 6","Cardio or Respiratory","Non-work related","Non-workers comp","Industry 2","Occupation 3","Self","Electronic Health Records","County B","Phone",1,1,null,1,null,1,null,1,null,1,null,"2019-07-08","2019-07-20","2019-07-20","2019-08-17","2019-08-27",{"$f":"IF(Table1[[#This Row],[First service received]]=1,\"Never dropped\",IF(Table1[[#This Row],[Enrolled]]=1,\"No first service\",IF(Table1[[#This Row],[Expressed interest]]=1,\"Not enrolled\",IF(Table1[[#This Row],[Eligible]]=1,\"Not interested\",IF(Table1[[#This Row],[Contacted]]=1,\"Not eligible\",IF(Table1[[#This Row],[Identified]]=1,\"Not contacted\",\"\"))))))","v":"Never dropped"},{"$f":"_xlfn.CONCAT(Table1[[#This Row],[Reason not contacted]],Table1[[#This Row],[Reason not eligible]],Table1[[#This Row],[Reason not interested]],Table1[[#This Row],[Reason not enrolled]],Table1[[#This Row],[Reason first service not received]])","v":""}]
[1570,null,"45 to 64 yrs","F","Non-Hispanic/Latino","White","Yes","Yes","No","Not Employed","0 to 1","MSK","Work related","Workers comp","Industry 3","Occupation 4","Health provider","Clinic appointment schedules","County B","Phone",1,1,null,1,null,1,null,1,null,1,null,"2019-07-08","2019-07-11","2019-07-11","2019-07-26","2019-08-02",{"$f":"IF(Table1[[#This Row],[First service received]]=1,\"Never dropped\",IF(Table1[[#This Row],[Enrolled]]=1,\"No first service\",IF(Table1[[#This Row],[Expressed interest]]=1,\"Not enrolled\",IF(Table1[[#This Row],[Eligible]]=1,\"Not interested\",IF(Table1[[#This Row],[Contacted]]=1,\"Not eligible\",IF(Table1[[#This Row],[Identified]]=1,\"Not contacted\",\"\"))))))","v":"Never dropped"},{"$f":"_xlfn.CONCAT(Table1[[#This Row],[Reason not contacted]],Table1[[#This Row],[Reason not eligible]],Table1[[#This Row],[Reason not interested]],Table1[[#This Row],[Reason not enrolled]],Table1[[#This Row],[Reason first service not received]])","v":""}]
[1030,null,"45 to 64 yrs","F","Non-Hispanic/Latino","White","Yes","Yes","No","Employed","2 to 6","MSK","Non-work related","Non-workers comp","Industry 1","Occupation 4","Health provider","Work restriction forms","County C","Phone",1,1,null,1,null,0,"Impact on provider relationship",0,null,0,null,"2019-07-09","2019-07-22","2019-08-23",null,null,{"$f":"IF(Table1[[#This Row],[First service received]]=1,\"Never dropped\",IF(Table1[[#This Row],[Enrolled]]=1,\"No first service\",IF(Table1[[#This Row],[Expressed interest]]=1,\"Not enrolled\",IF(Table1[[#This Row],[Eligible]]=1,\"Not interested\",IF(Table1[[#This Row],[Contacted]]=1,\"Not eligible\",IF(Table1[[#This Row],[Identified]]=1,\"Not contacted\",\"\"))))))","v":"Not interested"},{"$f":"_xlfn.CONCAT(Table1[[#This Row],[Reason not contacted]],Table1[[#This Row],[Reason not eligible]],Table1[[#This Row],[Reason not interested]],Table1[[#This Row],[Reason not enrolled]],Table1[[#This Row],[Reason first service not received]])","v":"Impact on provider relationship"}]
[1178,null,"25 to 44 yrs","F","Hispanic/Latino","White","Yes","Yes","No","Employed","7 to 12","Cardio or Respiratory","Non-work related","Non-workers comp","Industry 4","Occupation 3","Health provider","FMLA forms","County B","In person",1,1,null,0,"Ineligible reason2",0,null,0,null,0,null,"2019-07-09","2019-07-12","2019-08-19",null,null,{"$f":"IF(Table1[[#This Row],[First service received]]=1,\"Never dropped\",IF(Table1[[#This Row],[Enrolled]]=1,\"No first service\",IF(Table1[[#This Row],[Expressed interest]]=1,\"Not enrolled\",IF(Table1[[#This Row],[Eligible]]=1,\"Not interested\",IF(Table1[[#This Row],[Contacted]]=1,\"Not eligible\",IF(Table1[[#This Row],[Identified]]=1,\"Not contacted\",\"\"))))))","v":"Not eligible"},{"$f":"_xlfn.CONCAT(Table1[[#This Row],[Reason not contacted]],Table1[[#This Row],[Reason not eligible]],Table1[[#This Row],[Reason not interested]],Table1[[#This Row],[Reason not enrolled]],Table1[[#This Row],[Reason first service not received]])","v":"Ineligible reason2"}]
[1297,null,"25 to 44 yrs","M","Non-Hispanic/Latino","White","Yes","Yes","No","Not Employed","0 to 1","MSK","Work related","Workers comp","Industry 1","Occupation 1","Health provider","Clinic appointment schedules","County B","Phone",1,1,null,1,null,1,null,1,null,1,null,"2019-07-09","2019-07-22","2019-08-05","2019-08-10","2019-08-22",{"$f":"IF(Table1[[#This Row],[First service received]]=1,\"Never dropped\",IF(Table1[[#This Row],[Enrolled]]=1,\"No first service\",IF(Table1[[#This Row],[Expressed interest]]=1,\"Not enrolled\",IF(Table1[[#This Row],[Eligible]]=1,\"Not interested\",IF(Table1[[#This Row],[Contacted]]=1,\"Not eligible\",IF(Table1[[#This Row],[Identified]]=1,\"Not contacted\",\"\"))))))","v":"Never dropped"},{"$f":"_xlfn.CONCAT(Table1[[#This Row],[Reason not contacted]],Table1[[#This Row],[Reason not eligible]],Table1[[#This Row],[Reason not interested]],Table1[[#This Row],[Reason not enrolled]],Table1[[#This Row],[Reason first service not received]])","v":""}]
[1346,null,"25 to 44 yrs","M","Non-Hispanic/Latino","White","No","Yes","No","Not Employed","0 to 1","Other","Non-work related","Non-workers comp","Industry 3","Occupation 1","Workforce partner","Electronic Health Records","County B","Phone",1,1,null,1,null,0,"Not interested reason3",0,null,0,null,"2019-07-09","2019-07-17","2019-08-30",null,null,{"$f":"IF(Table1[[#This Row],[First service received]]=1,\"Never dropped\",IF(Table1[[#This Row],[Enrolled]]=1,\"No first service\",IF(Table1[[#This Row],[Expressed interest]]=1,\"Not enrolled\",IF(Table1[[#This Row],[Eligible]]=1,\"Not interested\",IF(Table1[[#This Row],[Contacted]]=1,\"Not eligible\",IF(Table1[[#This Row],[Identified]]=1,\"Not contacted\",\"\"))))))","v":"Not interested"},{"$f":"_xlfn.CONCAT(Table1[[#This Row],[Reason not contacted]],Table1[[#This Row],[Reason not eligible]],Table1[[#This Row],[Reason not interested]],Table1[[#This Row],[Reason not enrolled]],Table1[[#This Row],[Reason first service not received]])","v":"Not interested reason3"}]
[1361,null,"45 to 64 yrs","M","Non-Hispanic/Latino","Other or 2 or more","Yes","Yes","No","Employed","13+ weeks","Other","Non-work related","Non-workers comp","Industry 1","Occupation 3","Health provider","Work restriction forms","County A","Phone",1,1,null,1,null,1,null,1,null,1,null,"2019-07-09","2019-07-23","2019-08-04","2019-08-15","2019-08-24",{"$f":"IF(Table1[[#This Row],[First service received]]=1,\"Never dropped\",IF(Table1[[#This Row],[Enrolled]]=1,\"No first service\",IF(Table1[[#This Row],[Expressed interest]]=1,\"Not enrolled\",IF(Table1[[#This Row],[Eligible]]=1,\"Not interested\",IF(Table1[[#This Row],[Contacted]]=1,\"Not eligible\",IF(Table1[[#This Row],[Identified]]=1,\"Not contacted\",\"\"))))))","v":"Never dropped"},{"$f":"_xlfn.CONCAT(Table1[[#This Row],[Reason not contacted]],Table1[[#This Row],[Reason not eligible]],Table1[[#This Row],[Reason not interested]],Table1[[#This Row],[Reason not enrolled]],Table1[[#This Row],[Reason first service not received]])","v":""}]
[1223,null,"25 to 44 yrs","M","Hispanic/Latino","White","Yes","No","No","Employed","2 to 6","Cardio or Respiratory","Non-work related","Non-workers comp","Industry 3","Occupation 2","Health provider","Worker’s comp database","County B","In person",1,0,"Contacted, no response",0,null,0,null,0,null,0,null,"2019-07-10",null,null,null,null,{"$f":"IF(Table1[[#This Row],[First service received]]=1,\"Never dropped\",IF(Table1[[#This Row],[Enrolled]]=1,\"No first service\",IF(Table1[[#This Row],[Expressed interest]]=1,\"Not enrolled\",IF(Table1[[#This Row],[Eligible]]=1,\"Not interested\",IF(Table1[[#This Row],[Contacted]]=1,\"Not eligible\",IF(Table1[[#This Row],[Identified]]=1,\"Not contacted\",\"\"))))))","v":"Not contacted"},{"$f":"_xlfn.CONCAT(Table1[[#This Row],[Reason not contacted]],Table1[[#This Row],[Reason not eligible]],Table1[[#This Row],[Reason not interested]],Table1[[#This Row],[Reason not enrolled]],Table1[[#This Row],[Reason first service not received]])","v":"Contacted, no response"}]
[1270,null,"45 to 64 yrs","M","Non-Hispanic/Latino","Other or 2 or more","No","Yes","No","Employed","2 to 6","MSK","Work related","Workers comp","Industry 1","Occupation 3","Health provider","Worker’s comp database","County A","Phone",1,1,null,1,null,1,null,0,"Circumstances changed",0,null,"2019-07-10","2019-07-22","2019-08-09",null,null,{"$f":"IF(Table1[[#This Row],[First service received]]=1,\"Never dropped\",IF(Table1[[#This Row],[Enrolled]]=1,\"No first service\",IF(Table1[[#This Row],[Expressed interest]]=1,\"Not enrolled\",IF(Table1[[#This Row],[Eligible]]=1,\"Not interested\",IF(Table1[[#This Row],[Contacted]]=1,\"Not eligible\",IF(Table1[[#This Row],[Identified]]=1,\"Not contacted\",\"\"))))))","v":"Not enrolled"},{"$f":"_xlfn.CONCAT(Table1[[#This Row],[Reason not contacted]],Table1[[#This Row],[Reason not eligible]],Table1[[#This Row],[Reason not interested]],Table1[[#This Row],[Reason not enrolled]],Table1[[#This Row],[Reason first service not received]])","v":"Circumstances changed"}]
[1550,null,"45 to 64 yrs","F","Hispanic/Latino","White","Yes","Yes","No","Employed","0 to 1","MSK","Work related","Workers comp","Industry 2","Occupation 3","Self","Electronic Health Records","County B","Email",1,1,null,1,null,1,null,1,null,1,null,"2019-07-10","2019-07-13","2019-07-18","2019-08-12","2019-08-24",{"$f":"IF(Table1[[#This Row],[First service received]]=1,\"Never dropped\",IF(Table1[[#This Row],[Enrolled]]=1,\"No first service\",IF(Table1[[#This Row],[Expressed interest]]=1,\"Not enrolled\",IF(Table1[[#This Row],[Eligible]]=1,\"Not interested\",IF(Table1[[#This Row],[Contacted]]=1,\"Not eligible\",IF(Table1[[#This Row],[Identified]]=1,\"Not contacted\",\"\"))))))","v":"Never dropped"},{"$f":"_xlfn.CONCAT(Table1[[#This Row],[Reason not contacted]],Table1[[#This Row],[Reason not eligible]],Table1[[#This Row],[Reason not interested]],Table1[[#This Row],[Reason not enrolled]],Table1[[#This Row],[Reason first service not received]])","v":""}]
[1020,null,"25 to 44 yrs","M","Non-Hispanic/Latino","White","Yes","Yes","No","Employed","13+ weeks","MSK","Non-work related","Non-workers comp","Industry 1","Occupation 3","Workforce partner","Electronic Health Records","County B","In person",1,0,"Inaccurate contact info",0,null,0,null,0,null,0,null,"2019-07-11",null,null,null,null,{"$f":"IF(Table1[[#This Row],[First service received]]=1,\"Never dropped\",IF(Table1[[#This Row],[Enrolled]]=1,\"No first service\",IF(Table1[[#This Row],[Expressed interest]]=1,\"Not enrolled\",IF(Table1[[#This Row],[Eligible]]=1,\"Not interested\",IF(Table1[[#This Row],[Contacted]]=1,\"Not eligible\",IF(Table1[[#This Row],[Identified]]=1,\"Not contacted\",\"\"))))))","v":"Not contacted"},{"$f":"_xlfn.CONCAT(Table1[[#This Row],[Reason not contacted]],Table1[[#This Row],[Reason not eligible]],Table1[[#This Row],[Reason not interested]],Table1[[#This Row],[Reason not enrolled]],Table1[[#This Row],[Reason first service not received]])","v":"Inaccurate contact info"}]
[1062,null,"25 to 44 yrs","M","Hispanic/Latino","White","Yes","Yes","No","Employed","2 to 6","MSK","Work related","Non-workers comp","Industry 3","Occupation 2","Health provider","Worker’s comp database","County B","Phone",1,1,null,1,null,1,null,1,null,1,null,"2019-07-11","2019-07-25","2019-07-29","2019-08-11","2019-08-21",{"$f":"IF(Table1[[#This Row],[First service received]]=1,\"Never dropped\",IF(Table1[[#This Row],[Enrolled]]=1,\"No first service\",IF(Table1[[#This Row],[Expressed interest]]=1,\"Not enrolled\",IF(Table1[[#This Row],[Eligible]]=1,\"Not interested\",IF(Table1[[#This Row],[Contacted]]=1,\"Not eligible\",IF(Table1[[#This Row],[Identified]]=1,\"Not contacted\",\"\"))))))","v":"Never dropped"},{"$f":"_xlfn.CONCAT(Table1[[#This Row],[Reason not contacted]],Table1[[#This Row],[Reason not eligible]],Table1[[#This Row],[Reason not interested]],Table1[[#This Row],[Reason not enrolled]],Table1[[#This Row],[Reason first service not received]])","v":""}]
[1121,null,"45 to 64 yrs","F","Non-Hispanic/Latino","Black or African-American","Yes","Yes","Yes","Employed","7 to 12","MSK","Non-work related","Non-workers comp","Industry 3","Occupation 2","Health provider","Voc rehab centers","County B","Phone",1,1,null,1,null,1,null,1,null,0,"Returned to work","2019-07-11","2019-07-16","2019-07-27","2019-08-03",null,{"$f":"IF(Table1[[#This Row],[First service received]]=1,\"Never dropped\",IF(Table1[[#This Row],[Enrolled]]=1,\"No first service\",IF(Table1[[#This Row],[Expressed interest]]=1,\"Not enrolled\",IF(Table1[[#This Row],[Eligible]]=1,\"Not interested\",IF(Table1[[#This Row],[Contacted]]=1,\"Not eligible\",IF(Table1[[#This Row],[Identified]]=1,\"Not contacted\",\"\"))))))","v":"No first service"},{"$f":"_xlfn.CONCAT(Table1[[#This Row],[Reason not contacted]],Table1[[#This Row],[Reason not eligible]],Table1[[#This Row],[Reason not interested]],Table1[[#This Row],[Reason not enrolled]],Table1[[#This Row],[Reason first service not received]])","v":"Returned to work"}]
[1258,null,"25 to 44 yrs","F","Non-Hispanic/Latino","White","No","Yes","No","Not Employed","0 to 1","Other","Non-work related","Non-workers comp","Industry 3","Occupation 2","Health provider","Worker’s comp database","County B","In person",1,1,null,0,"Ineligible reason3",0,null,0,null,0,null,"2019-07-11","2019-07-15","2019-07-18",null,null,{"$f":"IF(Table1[[#This Row],[First service received]]=1,\"Never dropped\",IF(Table1[[#This Row],[Enrolled]]=1,\"No first service\",IF(Table1[[#This Row],[Expressed interest]]=1,\"Not enrolled\",IF(Table1[[#This Row],[Eligible]]=1,\"Not interested\",IF(Table1[[#This Row],[Contacted]]=1,\"Not eligible\",IF(Table1[[#This Row],[Identified]]=1,\"Not contacted\",\"\"))))))","v":"Not eligible"},{"$f":"_xlfn.CONCAT(Table1[[#This Row],[Reason not contacted]],Table1[[#This Row],[Reason not eligible]],Table1[[#This Row],[Reason not interested]],Table1[[#This Row],[Reason not enrolled]],Table1[[#This Row],[Reason first service not received]])","v":"Ineligible reason3"}]
[1268,null,"25 to 44 yrs","F","Hispanic/Latino","White","Yes","Yes","No","Employed","7 to 12","MSK","Non-work related","Non-workers comp","Industry 3","Occupation 3","Workforce partner","Electronic Health Records","County B","Phone",1,0,"No contact info",0,null,0,null,0,null,0,null,"2019-07-11",null,null,null,null,{"$f":"IF(Table1[[#This Row],[First service received]]=1,\"Never dropped\",IF(Table1[[#This Row],[Enrolled]]=1,\"No first service\",IF(Table1[[#This Row],[Expressed interest]]=1,\"Not enrolled\",IF(Table1[[#This Row],[Eligible]]=1,\"Not interested\",IF(Table1[[#This Row],[Contacted]]=1,\"Not eligible\",IF(Table1[[#This Row],[Identified]]=1,\"Not contacted\",\"\"))))))","v":"Not contacted"},{"$f":"_xlfn.CONCAT(Table1[[#This Row],[Reason not contacted]],Table1[[#This Row],[Reason not eligible]],Table1[[#This Row],[Reason not interested]],Table1[[#This Row],[Reason not enrolled]],Table1[[#This Row],[Reason first service not received]])","v":"No contact info"}]
[1314,null,"25 to 44 yrs","M","Non-Hispanic/Latino","White","Yes","No","No","Employed","2 to 6","MSK","Work related","Non-workers comp","Industry 4","Occupation 3","Health provider","FMLA forms","County B","In person",1,1,null,1,null,1,null,1,null,0,"Returned to work","2019-07-11","2019-07-13","2019-07-21","2019-08-11",null,{"$f":"IF(Table1[[#This Row],[First service received]]=1,\"Never dropped\",IF(Table1[[#This Row],[Enrolled]]=1,\"No first service\",IF(Table1[[#This Row],[Expressed interest]]=1,\"Not enrolled\",IF(Table1[[#This Row],[Eligible]]=1,\"Not interested\",IF(Table1[[#This Row],[Contacted]]=1,\"Not eligible\",IF(Table1[[#This Row],[Identified]]=1,\"Not contacted\",\"\"))))))","v":"No first service"},{"$f":"_xlfn.CONCAT(Table1[[#This Row],[Reason not contacted]],Table1[[#This Row],[Reason not eligible]],Table1[[#This Row],[Reason not interested]],Table1[[#This Row],[Reason not enrolled]],Table1[[#This Row],[Reason first service not received]])","v":"Returned to work"}]
[1552,null,"45 to 64 yrs","M","Non-Hispanic/Latino","White","Yes","Yes","No","Employed","7 to 12","Other","Non-work related","Non-workers comp","Industry 1","Occupation 3","Workforce partner","Electronic Health Records","County A","Other",1,0,"No contact info",0,null,0,null,0,null,0,null,"2019-07-12",null,null,null,null,{"$f":"IF(Table1[[#This Row],[First service received]]=1,\"Never dropped\",IF(Table1[[#This Row],[Enrolled]]=1,\"No first service\",IF(Table1[[#This Row],[Expressed interest]]=1,\"Not enrolled\",IF(Table1[[#This Row],[Eligible]]=1,\"Not interested\",IF(Table1[[#This Row],[Contacted]]=1,\"Not eligible\",IF(Table1[[#This Row],[Identified]]=1,\"Not contacted\",\"\"))))))","v":"Not contacted"},{"$f":"_xlfn.CONCAT(Table1[[#This Row],[Reason not contacted]],Table1[[#This Row],[Reason not eligible]],Table1[[#This Row],[Reason not interested]],Table1[[#This Row],[Reason not enrolled]],Table1[[#This Row],[Reason first service not received]])","v":"No contact info"}]
[1137,null,"65 yrs +","M","Hispanic/Latino","White","Yes","Yes","No","Employed","2 to 6","MSK","Non-work related","Non-workers comp","Industry 1","Occupation 4","Health provider","Worker’s comp database","County A","In person",1,1,null,1,null,1,null,1,null,1,null,"2019-07-13","2019-07-27","2019-08-07","2019-08-13","2019-08-19",{"$f":"IF(Table1[[#This Row],[First service received]]=1,\"Never dropped\",IF(Table1[[#This Row],[Enrolled]]=1,\"No first service\",IF(Table1[[#This Row],[Expressed interest]]=1,\"Not enrolled\",IF(Table1[[#This Row],[Eligible]]=1,\"Not interested\",IF(Table1[[#This Row],[Contacted]]=1,\"Not eligible\",IF(Table1[[#This Row],[Identified]]=1,\"Not contacted\",\"\"))))))","v":"Never dropped"},{"$f":"_xlfn.CONCAT(Table1[[#This Row],[Reason not contacted]],Table1[[#This Row],[Reason not eligible]],Table1[[#This Row],[Reason not interested]],Table1[[#This Row],[Reason not enrolled]],Table1[[#This Row],[Reason first service not received]])","v":""}]
[1271,null,"45 to 64 yrs","M","Non-Hispanic/Latino","White","Yes","Yes","No","Employed","7 to 12","MSK","Non-work related","Non-workers comp","Industry 1","Occupation 3","Health provider","FMLA forms","County B","In person",1,1,null,0,"Ineligible reason1",0,null,0,null,0,null,"2019-07-13","2019-07-27","2019-08-13",null,null,{"$f":"IF(Table1[[#This Row],[First service received]]=1,\"Never dropped\",IF(Table1[[#This Row],[Enrolled]]=1,\"No first service\",IF(Table1[[#This Row],[Expressed interest]]=1,\"Not enrolled\",IF(Table1[[#This Row],[Eligible]]=1,\"Not interested\",IF(Table1[[#This Row],[Contacted]]=1,\"Not eligible\",IF(Table1[[#This Row],[Identified]]=1,\"Not contacted\",\"\"))))))","v":"Not eligible"},{"$f":"_xlfn.CONCAT(Table1[[#This Row],[Reason not contacted]],Table1[[#This Row],[Reason not eligible]],Table1[[#This Row],[Reason not interested]],Table1[[#This Row],[Reason not enrolled]],Table1[[#This Row],[Reason first service not received]])","v":"Ineligible reason1"}]
[1304,null,"18 to 24 yrs","F","Non-Hispanic/Latino","White","Yes","Yes","No","Employed","2 to 6","MSK","Non-work related","Non-workers comp","Industry 1","Occupation 3","Health provider","Worker’s comp database","County C","Phone",1,1,null,1,null,0,"Not interested reason3",0,null,0,null,"2019-07-13","2019-07-23","2019-08-09",null,null,{"$f":"IF(Table1[[#This Row],[First service received]]=1,\"Never dropped\",IF(Table1[[#This Row],[Enrolled]]=1,\"No first service\",IF(Table1[[#This Row],[Expressed interest]]=1,\"Not enrolled\",IF(Table1[[#This Row],[Eligible]]=1,\"Not interested\",IF(Table1[[#This Row],[Contacted]]=1,\"Not eligible\",IF(Table1[[#This Row],[Identified]]=1,\"Not contacted\",\"\"))))))","v":"Not interested"},{"$f":"_xlfn.CONCAT(Table1[[#This Row],[Reason not contacted]],Table1[[#This Row],[Reason not eligible]],Table1[[#This Row],[Reason not interested]],Table1[[#This Row],[Reason not enrolled]],Table1[[#This Row],[Reason first service not received]])","v":"Not interested reason3"}]
[1340,null,"25 to 44 yrs","M","Non-Hispanic/Latino","American Indian or Alaska Native","Yes","Yes","No","Employed","7 to 12","MSK","Work related","Non-workers comp","Industry 4","Occupation 1","Health provider","Clinic appointment schedules","County B","Other",1,0,"Inaccurate contact info",0,null,0,null,0,null,0,null,"2019-07-13",null,null,null,null,{"$f":"IF(Table1[[#This Row],[First service received]]=1,\"Never dropped\",IF(Table1[[#This Row],[Enrolled]]=1,\"No first service\",IF(Table1[[#This Row],[Expressed interest]]=1,\"Not enrolled\",IF(Table1[[#This Row],[Eligible]]=1,\"Not interested\",IF(Table1[[#This Row],[Contacted]]=1,\"Not eligible\",IF(Table1[[#This Row],[Identified]]=1,\"Not contacted\",\"\"))))))","v":"Not contacted"},{"$f":"_xlfn.CONCAT(Table1[[#This Row],[Reason not contacted]],Table1[[#This Row],[Reason not eligible]],Table1[[#This Row],[Reason not interested]],Table1[[#This Row],[Reason not enrolled]],Table1[[#This Row],[Reason first service not received]])","v":"Inaccurate contact info"}]
[1479,null,"45 to 64 yrs","F","Non-Hispanic/Latino","White","No","Yes","No","Employed","7 to 12","MSK","Work related","Workers comp","Industry 4","Occupation 3","Health provider","FMLA forms","County B","Email",1,1,null,1,null,1,null,1,null,1,null,"2019-07-13","2019-07-19","2019-07-26","2019-08-15","2019-08-21",{"$f":"IF(Table1[[#This Row],[First service received]]=1,\"Never dropped\",IF(Table1[[#This Row],[Enrolled]]=1,\"No first service\",IF(Table1[[#This Row],[Expressed interest]]=1,\"Not enrolled\",IF(Table1[[#This Row],[Eligible]]=1,\"Not interested\",IF(Table1[[#This Row],[Contacted]]=1,\"Not eligible\",IF(Table1[[#This Row],[Identified]]=1,\"Not contacted\",\"\"))))))","v":"Never dropped"},{"$f":"_xlfn.CONCAT(Table1[[#This Row],[Reason not contacted]],Table1[[#This Row],[Reason not eligible]],Table1[[#This Row],[Reason not interested]],Table1[[#This Row],[Reason not enrolled]],Table1[[#This Row],[Reason first service not received]])","v":""}]
[1499,null,"45 to 64 yrs","M","Non-Hispanic/Latino","White","Yes","Yes","No","Employed","7 to 12","MSK","Non-work related","Non-workers comp","Industry 1","Occupation 3","Health provider","Clinic appointment schedules","County B","Phone",1,1,null,1,null,0,"Don't want to be in research study",0,null,0,null,"2019-07-15","2019-07-23","2019-07-26",null,null,{"$f":"IF(Table1[[#This Row],[First service received]]=1,\"Never dropped\",IF(Table1[[#This Row],[Enrolled]]=1,\"No first service\",IF(Table1[[#This Row],[Expressed interest]]=1,\"Not enrolled\",IF(Table1[[#This Row],[Eligible]]=1,\"Not interested\",IF(Table1[[#This Row],[Contacted]]=1,\"Not eligible\",IF(Table1[[#This Row],[Identified]]=1,\"Not contacted\",\"\"))))))","v":"Not interested"},{"$f":"_xlfn.CONCAT(Table1[[#This Row],[Reason not contacted]],Table1[[#This Row],[Reason not eligible]],Table1[[#This Row],[Reason not interested]],Table1[[#This Row],[Reason not enrolled]],Table1[[#This Row],[Reason first service not received]])","v":"Don't want to be in research study"}]
[1565,null,"25 to 44 yrs","F","Hispanic/Latino","White","Yes","Yes","No","Self-employed","13+ weeks","Other","Non-work related","Non-workers comp","Industry 3","Occupation 2","Health provider","Voc rehab centers","County B","In person",1,1,null,1,null,1,null,1,null,1,null,"2019-07-15","2019-07-24","2019-08-04","2019-08-13","2019-08-23",{"$f":"IF(Table1[[#This Row],[First service received]]=1,\"Never dropped\",IF(Table1[[#This Row],[Enrolled]]=1,\"No first service\",IF(Table1[[#This Row],[Expressed interest]]=1,\"Not enrolled\",IF(Table1[[#This Row],[Eligible]]=1,\"Not interested\",IF(Table1[[#This Row],[Contacted]]=1,\"Not eligible\",IF(Table1[[#This Row],[Identified]]=1,\"Not contacted\",\"\"))))))","v":"Never dropped"},{"$f":"_xlfn.CONCAT(Table1[[#This Row],[Reason not contacted]],Table1[[#This Row],[Reason not eligible]],Table1[[#This Row],[Reason not interested]],Table1[[#This Row],[Reason not enrolled]],Table1[[#This Row],[Reason first service not received]])","v":""}]
[1085,null,"25 to 44 yrs","M","Non-Hispanic/Latino","White","Yes","Yes","No","Employed","2 to 6","MSK","Work related","Non-workers comp","Industry 4","Occupation 1","Health provider","FMLA forms","County B","Phone",1,1,null,1,null,0,"Don't want to be in research study",0,null,0,null,"2019-07-16","2019-07-26","2019-09-05",null,null,{"$f":"IF(Table1[[#This Row],[First service received]]=1,\"Never dropped\",IF(Table1[[#This Row],[Enrolled]]=1,\"No first service\",IF(Table1[[#This Row],[Expressed interest]]=1,\"Not enrolled\",IF(Table1[[#This Row],[Eligible]]=1,\"Not interested\",IF(Table1[[#This Row],[Contacted]]=1,\"Not eligible\",IF(Table1[[#This Row],[Identified]]=1,\"Not contacted\",\"\"))))))","v":"Not interested"},{"$f":"_xlfn.CONCAT(Table1[[#This Row],[Reason not contacted]],Table1[[#This Row],[Reason not eligible]],Table1[[#This Row],[Reason not interested]],Table1[[#This Row],[Reason not enrolled]],Table1[[#This Row],[Reason first service not received]])","v":"Don't want to be in research study"}]
[1135,null,"45 to 64 yrs","F","Non-Hispanic/Latino","Other or 2 or more","Yes","Yes","No","Employed","0 to 1","MSK","Non-work related","Non-workers comp","Industry 4","Occupation 1","Health provider","Worker’s comp database","County B","Phone",1,1,null,1,null,0,"Impact on provider relationship",0,null,0,null,"2019-07-16","2019-07-19","2019-08-14",null,null,{"$f":"IF(Table1[[#This Row],[First service received]]=1,\"Never dropped\",IF(Table1[[#This Row],[Enrolled]]=1,\"No first service\",IF(Table1[[#This Row],[Expressed interest]]=1,\"Not enrolled\",IF(Table1[[#This Row],[Eligible]]=1,\"Not interested\",IF(Table1[[#This Row],[Contacted]]=1,\"Not eligible\",IF(Table1[[#This Row],[Identified]]=1,\"Not contacted\",\"\"))))))","v":"Not interested"},{"$f":"_xlfn.CONCAT(Table1[[#This Row],[Reason not contacted]],Table1[[#This Row],[Reason not eligible]],Table1[[#This Row],[Reason not interested]],Table1[[#This Row],[Reason not enrolled]],Table1[[#This Row],[Reason first service not received]])","v":"Impact on provider relationship"}]
[1169,null,"45 to 64 yrs","F","Non-Hispanic/Latino","White","No","Yes","No","Employed","7 to 12","Other","Work related","Workers comp","Industry 3","Occupation 2","Health provider","Clinic appointment schedules","County B","In person",1,1,null,1,null,0,"Impact on provider relationship",0,null,0,null,"2019-07-16","2019-07-23","2019-08-05",null,null,{"$f":"IF(Table1[[#This Row],[First service received]]=1,\"Never dropped\",IF(Table1[[#This Row],[Enrolled]]=1,\"No first service\",IF(Table1[[#This Row],[Expressed interest]]=1,\"Not enrolled\",IF(Table1[[#This Row],[Eligible]]=1,\"Not interested\",IF(Table1[[#This Row],[Contacted]]=1,\"Not eligible\",IF(Table1[[#This Row],[Identified]]=1,\"Not contacted\",\"\"))))))","v":"Not interested"},{"$f":"_xlfn.CONCAT(Table1[[#This Row],[Reason not contacted]],Table1[[#This Row],[Reason not eligible]],Table1[[#This Row],[Reason not interested]],Table1[[#This Row],[Reason not enrolled]],Table1[[#This Row],[Reason first service not received]])","v":"Impact on provider relationship"}]
[1483,null,"25 to 44 yrs","M","Non-Hispanic/Latino","Black or African-American","Yes","Yes","No","Employed","7 to 12","Other","Non-work related","Non-workers comp","Industry 1","Occupation 1","Employer","Electronic Health Records","County B","Email",1,1,null,1,null,1,null,1,null,1,null,"2019-07-16","2019-07-27","2019-08-02","2019-08-10","2019-08-24",{"$f":"IF(Table1[[#This Row],[First service received]]=1,\"Never dropped\",IF(Table1[[#This Row],[Enrolled]]=1,\"No first service\",IF(Table1[[#This Row],[Expressed interest]]=1,\"Not enrolled\",IF(Table1[[#This Row],[Eligible]]=1,\"Not interested\",IF(Table1[[#This Row],[Contacted]]=1,\"Not eligible\",IF(Table1[[#This Row],[Identified]]=1,\"Not contacted\",\"\"))))))","v":"Never dropped"},{"$f":"_xlfn.CONCAT(Table1[[#This Row],[Reason not contacted]],Table1[[#This Row],[Reason not eligible]],Table1[[#This Row],[Reason not interested]],Table1[[#This Row],[Reason not enrolled]],Table1[[#This Row],[Reason first service not received]])","v":""}]
[1578,null,"45 to 64 yrs","F","Non-Hispanic/Latino","White","No","Yes","No","Employed","7 to 12","Other","Work related","Workers comp","Industry 1","Occupation 3","Self","Electronic Health Records","County A","Phone",1,1,null,1,null,0,"Don't want to be in research study",0,null,0,null,"2019-07-16","2019-07-21","2019-08-04",null,null,{"$f":"IF(Table1[[#This Row],[First service received]]=1,\"Never dropped\",IF(Table1[[#This Row],[Enrolled]]=1,\"No first service\",IF(Table1[[#This Row],[Expressed interest]]=1,\"Not enrolled\",IF(Table1[[#This Row],[Eligible]]=1,\"Not interested\",IF(Table1[[#This Row],[Contacted]]=1,\"Not eligible\",IF(Table1[[#This Row],[Identified]]=1,\"Not contacted\",\"\"))))))","v":"Not interested"},{"$f":"_xlfn.CONCAT(Table1[[#This Row],[Reason not contacted]],Table1[[#This Row],[Reason not eligible]],Table1[[#This Row],[Reason not interested]],Table1[[#This Row],[Reason not enrolled]],Table1[[#This Row],[Reason first service not received]])","v":"Don't want to be in research study"}]
[1038,null,"45 to 64 yrs","M","Non-Hispanic/Latino","White","Yes","Yes","No","Employed","7 to 12","MSK","Work related","Non-workers comp","Industry 1","Occupation 3","Health provider","Clinic appointment schedules","County B","Phone",1,1,null,0,"Ineligible reason1",0,null,0,null,0,null,"2019-07-17","2019-07-30","2019-08-07",null,null,{"$f":"IF(Table1[[#This Row],[First service received]]=1,\"Never dropped\",IF(Table1[[#This Row],[Enrolled]]=1,\"No first service\",IF(Table1[[#This Row],[Expressed interest]]=1,\"Not enrolled\",IF(Table1[[#This Row],[Eligible]]=1,\"Not interested\",IF(Table1[[#This Row],[Contacted]]=1,\"Not eligible\",IF(Table1[[#This Row],[Identified]]=1,\"Not contacted\",\"\"))))))","v":"Not eligible"},{"$f":"_xlfn.CONCAT(Table1[[#This Row],[Reason not contacted]],Table1[[#This Row],[Reason not eligible]],Table1[[#This Row],[Reason not interested]],Table1[[#This Row],[Reason not enrolled]],Table1[[#This Row],[Reason first service not received]])","v":"Ineligible reason1"}]
[1470,null,"25 to 44 yrs","F","Non-Hispanic/Latino","American Indian or Alaska Native","Yes","Yes","No","Employed","0 to 1","MSK","Non-work related","Non-workers comp","Industry 2","Occupation 4","Health provider","Worker’s comp database","County B","Phone",1,0,"Contacted, no response",0,null,0,null,0,null,0,null,"2019-07-17",null,null,null,null,{"$f":"IF(Table1[[#This Row],[First service received]]=1,\"Never dropped\",IF(Table1[[#This Row],[Enrolled]]=1,\"No first service\",IF(Table1[[#This Row],[Expressed interest]]=1,\"Not enrolled\",IF(Table1[[#This Row],[Eligible]]=1,\"Not interested\",IF(Table1[[#This Row],[Contacted]]=1,\"Not eligible\",IF(Table1[[#This Row],[Identified]]=1,\"Not contacted\",\"\"))))))","v":"Not contacted"},{"$f":"_xlfn.CONCAT(Table1[[#This Row],[Reason not contacted]],Table1[[#This Row],[Reason not eligible]],Table1[[#This Row],[Reason not interested]],Table1[[#This Row],[Reason not enrolled]],Table1[[#This Row],[Reason first service not received]])","v":"Contacted, no response"}]
[1494,null,"45 to 64 yrs","M","Non-Hispanic/Latino","White","Yes","Yes","No","Not Employed","0 to 1","MSK","Non-work related","Non-workers comp","Industry 4","Occupation 4","Employer","Electronic Health Records","County A","Phone",1,1,null,1,null,1,null,1,null,1,null,"2019-07-17","2019-07-21","2019-07-23","2019-08-13","2019-08-23",{"$f":"IF(Table1[[#This Row],[First service received]]=1,\"Never dropped\",IF(Table1[[#This Row],[Enrolled]]=1,\"No first service\",IF(Table1[[#This Row],[Expressed interest]]=1,\"Not enrolled\",IF(Table1[[#This Row],[Eligible]]=1,\"Not interested\",IF(Table1[[#This Row],[Contacted]]=1,\"Not eligible\",IF(Table1[[#This Row],[Identified]]=1,\"Not contacted\",\"\"))))))","v":"Never dropped"},{"$f":"_xlfn.CONCAT(Table1[[#This Row],[Reason not contacted]],Table1[[#This Row],[Reason not eligible]],Table1[[#This Row],[Reason not interested]],Table1[[#This Row],[Reason not enrolled]],Table1[[#This Row],[Reason first service not received]])","v":""}]
[1219,null,"25 to 44 yrs","F","Non-Hispanic/Latino","White","Yes","Yes","No","Employed","7 to 12","Other","Non-work related","Non-workers comp","Industry 3","Occupation 2","Employer","Electronic Health Records","County C","Phone",1,1,null,1,null,1,null,1,null,0,"Returned to work","2019-07-18","2019-07-23","2019-07-30","2019-08-12",null,{"$f":"IF(Table1[[#This Row],[First service received]]=1,\"Never dropped\",IF(Table1[[#This Row],[Enrolled]]=1,\"No first service\",IF(Table1[[#This Row],[Expressed interest]]=1,\"Not enrolled\",IF(Table1[[#This Row],[Eligible]]=1,\"Not interested\",IF(Table1[[#This Row],[Contacted]]=1,\"Not eligible\",IF(Table1[[#This Row],[Identified]]=1,\"Not contacted\",\"\"))))))","v":"No first service"},{"$f":"_xlfn.CONCAT(Table1[[#This Row],[Reason not contacted]],Table1[[#This Row],[Reason not eligible]],Table1[[#This Row],[Reason not interested]],Table1[[#This Row],[Reason not enrolled]],Table1[[#This Row],[Reason first service not received]])","v":"Returned to work"}]
[1274,null,"45 to 64 yrs","M","Non-Hispanic/Latino","White","No","Yes","No","Self-employed","13+ weeks","MSK","Non-work related","Non-workers comp","Industry 3","Occupation 2","Self","Electronic Health Records","County A","Email",1,1,null,1,null,1,null,0,"Circumstances changed",0,null,"2019-07-18","2019-07-23","2019-08-04",null,null,{"$f":"IF(Table1[[#This Row],[First service received]]=1,\"Never dropped\",IF(Table1[[#This Row],[Enrolled]]=1,\"No first service\",IF(Table1[[#This Row],[Expressed interest]]=1,\"Not enrolled\",IF(Table1[[#This Row],[Eligible]]=1,\"Not interested\",IF(Table1[[#This Row],[Contacted]]=1,\"Not eligible\",IF(Table1[[#This Row],[Identified]]=1,\"Not contacted\",\"\"))))))","v":"Not enrolled"},{"$f":"_xlfn.CONCAT(Table1[[#This Row],[Reason not contacted]],Table1[[#This Row],[Reason not eligible]],Table1[[#This Row],[Reason not interested]],Table1[[#This Row],[Reason not enrolled]],Table1[[#This Row],[Reason first service not received]])","v":"Circumstances changed"}]
[1285,null,"25 to 44 yrs","F","Non-Hispanic/Latino","White","Yes","Yes","No","Self-employed","13+ weeks","MSK","Work related","Non-workers comp","Industry 4","Occupation 3","Employer","Electronic Health Records","County C","Email",1,1,null,0,"Ineligible reason2",0,null,0,null,0,null,"2019-07-18","2019-07-30","2019-08-29",null,null,{"$f":"IF(Table1[[#This Row],[First service received]]=1,\"Never dropped\",IF(Table1[[#This Row],[Enrolled]]=1,\"No first service\",IF(Table1[[#This Row],[Expressed interest]]=1,\"Not enrolled\",IF(Table1[[#This Row],[Eligible]]=1,\"Not interested\",IF(Table1[[#This Row],[Contacted]]=1,\"Not eligible\",IF(Table1[[#This Row],[Identified]]=1,\"Not contacted\",\"\"))))))","v":"Not eligible"},{"$f":"_xlfn.CONCAT(Table1[[#This Row],[Reason not contacted]],Table1[[#This Row],[Reason not eligible]],Table1[[#This Row],[Reason not interested]],Table1[[#This Row],[Reason not enrolled]],Table1[[#This Row],[Reason first service not received]])","v":"Ineligible reason2"}]
[1452,null,"45 to 64 yrs","F","Non-Hispanic/Latino","Hawaiian or Pacific Islander","No","Yes","No","Employed","2 to 6","Other","Non-work related","Non-workers comp","Industry 1","Occupation 3","Employer","Electronic Health Records","County A","Email",1,0,"Contacted, no response",0,null,0,null,0,null,0,null,"2019-07-18",null,null,null,null,{"$f":"IF(Table1[[#This Row],[First service received]]=1,\"Never dropped\",IF(Table1[[#This Row],[Enrolled]]=1,\"No first service\",IF(Table1[[#This Row],[Expressed interest]]=1,\"Not enrolled\",IF(Table1[[#This Row],[Eligible]]=1,\"Not interested\",IF(Table1[[#This Row],[Contacted]]=1,\"Not eligible\",IF(Table1[[#This Row],[Identified]]=1,\"Not contacted\",\"\"))))))","v":"Not contacted"},{"$f":"_xlfn.CONCAT(Table1[[#This Row],[Reason not contacted]],Table1[[#This Row],[Reason not eligible]],Table1[[#This Row],[Reason not interested]],Table1[[#This Row],[Reason not enrolled]],Table1[[#This Row],[Reason first service not received]])","v":"Contacted, no response"}]
[1608,null,"45 to 64 yrs","M","Non-Hispanic/Latino","Other or 2 or more","Yes","Yes","No","Employed","13+ weeks","Other","Non-work related","Non-workers comp","Industry 1","Occupation 3","Health provider","Work restriction forms","County A","Phone",1,0,"No contact info",0,null,0,null,0,null,0,null,"2019-07-19",null,null,null,null,{"$f":"IF(Table1[[#This Row],[First service received]]=1,\"Never dropped\",IF(Table1[[#This Row],[Enrolled]]=1,\"No first service\",IF(Table1[[#This Row],[Expressed interest]]=1,\"Not enrolled\",IF(Table1[[#This Row],[Eligible]]=1,\"Not interested\",IF(Table1[[#This Row],[Contacted]]=1,\"Not eligible\",IF(Table1[[#This Row],[Identified]]=1,\"Not contacted\",\"\"))))))","v":"Not contacted"},{"$f":"_xlfn.CONCAT(Table1[[#This Row],[Reason not contacted]],Table1[[#This Row],[Reason not eligible]],Table1[[#This Row],[Reason not interested]],Table1[[#This Row],[Reason not enrolled]],Table1[[#This Row],[Reason first service not received]])","v":"No contact info"}]
[1097,null,"25 to 44 yrs","M","Non-Hispanic/Latino","White","Yes","Yes","No","Not Employed","0 to 1","MSK","Work related","Workers comp","Industry 1","Occupation 1","Health provider","Clinic appointment schedules","County B","Phone",1,1,null,1,null,1,null,1,null,1,null,"2019-07-20","2019-07-21","2019-07-30","2019-08-13","2019-08-16",{"$f":"IF(Table1[[#This Row],[First service received]]=1,\"Never dropped\",IF(Table1[[#This Row],[Enrolled]]=1,\"No first service\",IF(Table1[[#This Row],[Expressed interest]]=1,\"Not enrolled\",IF(Table1[[#This Row],[Eligible]]=1,\"Not interested\",IF(Table1[[#This Row],[Contacted]]=1,\"Not eligible\",IF(Table1[[#This Row],[Identified]]=1,\"Not contacted\",\"\"))))))","v":"Never dropped"},{"$f":"_xlfn.CONCAT(Table1[[#This Row],[Reason not contacted]],Table1[[#This Row],[Reason not eligible]],Table1[[#This Row],[Reason not interested]],Table1[[#This Row],[Reason not enrolled]],Table1[[#This Row],[Reason first service not received]])","v":""}]
[1175,null,"25 to 44 yrs","M","Non-Hispanic/Latino","White","Yes","Yes","No","Employed","7 to 12","Other","Non-work related","Non-workers comp","Industry 2","Occupation 3","Self","Electronic Health Records","County A","Email",1,0,"Contacted, no response",0,null,0,null,0,null,0,null,"2019-07-20",null,null,null,null,{"$f":"IF(Table1[[#This Row],[First service received]]=1,\"Never dropped\",IF(Table1[[#This Row],[Enrolled]]=1,\"No first service\",IF(Table1[[#This Row],[Expressed interest]]=1,\"Not enrolled\",IF(Table1[[#This Row],[Eligible]]=1,\"Not interested\",IF(Table1[[#This Row],[Contacted]]=1,\"Not eligible\",IF(Table1[[#This Row],[Identified]]=1,\"Not contacted\",\"\"))))))","v":"Not contacted"},{"$f":"_xlfn.CONCAT(Table1[[#This Row],[Reason not contacted]],Table1[[#This Row],[Reason not eligible]],Table1[[#This Row],[Reason not interested]],Table1[[#This Row],[Reason not enrolled]],Table1[[#This Row],[Reason first service not received]])","v":"Contacted, no response"}]
[1148,null,"45 to 64 yrs","M","Hispanic/Latino","White","Yes","Yes","No","Not Employed","0 to 1","MSK","Non-work related","Non-workers comp","Industry 3","Occupation 2","Health provider","FMLA forms","County A","In person",1,1,null,1,null,0,"Impact on provider relationship",0,null,0,null,"2019-07-21","2019-07-23","2019-08-09",null,null,{"$f":"IF(Table1[[#This Row],[First service received]]=1,\"Never dropped\",IF(Table1[[#This Row],[Enrolled]]=1,\"No first service\",IF(Table1[[#This Row],[Expressed interest]]=1,\"Not enrolled\",IF(Table1[[#This Row],[Eligible]]=1,\"Not interested\",IF(Table1[[#This Row],[Contacted]]=1,\"Not eligible\",IF(Table1[[#This Row],[Identified]]=1,\"Not contacted\",\"\"))))))","v":"Not interested"},{"$f":"_xlfn.CONCAT(Table1[[#This Row],[Reason not contacted]],Table1[[#This Row],[Reason not eligible]],Table1[[#This Row],[Reason not interested]],Table1[[#This Row],[Reason not enrolled]],Table1[[#This Row],[Reason first service not received]])","v":"Impact on provider relationship"}]
[1322,null,"25 to 44 yrs","F","Hispanic/Latino","White","Yes","Yes","No","Employed","7 to 12","MSK","Non-work related","Non-workers comp","Industry 3","Occupation 2","Health provider","Work restriction forms","County A","In person",1,1,null,1,null,1,null,1,null,1,null,"2019-07-21","2019-07-25","2019-08-04","2019-08-17","2019-08-20",{"$f":"IF(Table1[[#This Row],[First service received]]=1,\"Never dropped\",IF(Table1[[#This Row],[Enrolled]]=1,\"No first service\",IF(Table1[[#This Row],[Expressed interest]]=1,\"Not enrolled\",IF(Table1[[#This Row],[Eligible]]=1,\"Not interested\",IF(Table1[[#This Row],[Contacted]]=1,\"Not eligible\",IF(Table1[[#This Row],[Identified]]=1,\"Not contacted\",\"\"))))))","v":"Never dropped"},{"$f":"_xlfn.CONCAT(Table1[[#This Row],[Reason not contacted]],Table1[[#This Row],[Reason not eligible]],Table1[[#This Row],[Reason not interested]],Table1[[#This Row],[Reason not enrolled]],Table1[[#This Row],[Reason first service not received]])","v":""}]
[1462,null,"45 to 64 yrs","M","Non-Hispanic/Latino","White","Yes","Yes","No","Employed","2 to 6","Other","Work related","Workers comp","Industry 1","Occupation 3","Health provider","Worker’s comp database","County B","In person",1,1,null,1,null,0,"Impact on provider relationship",0,null,0,null,"2019-07-21","2019-08-03","2019-09-03",null,null,{"$f":"IF(Table1[[#This Row],[First service received]]=1,\"Never dropped\",IF(Table1[[#This Row],[Enrolled]]=1,\"No first service\",IF(Table1[[#This Row],[Expressed interest]]=1,\"Not enrolled\",IF(Table1[[#This Row],[Eligible]]=1,\"Not interested\",IF(Table1[[#This Row],[Contacted]]=1,\"Not eligible\",IF(Table1[[#This Row],[Identified]]=1,\"Not contacted\",\"\"))))))","v":"Not interested"},{"$f":"_xlfn.CONCAT(Table1[[#This Row],[Reason not contacted]],Table1[[#This Row],[Reason not eligible]],Table1[[#This Row],[Reason not interested]],Table1[[#This Row],[Reason not enrolled]],Table1[[#This Row],[Reason first service not received]])","v":"Impact on provider relationship"}]
[1538,null,"45 to 64 yrs","F","Non-Hispanic/Latino","Other or 2 or more","No","Yes","No","Employed","0 to 1","MSK","Work related","Non-workers comp","Industry 3","Occupation 3","Workforce partner","Electronic Health Records","County B","Phone",1,1,null,1,null,0,"Don't want to be in research study",0,null,0,null,"2019-07-21","2019-07-26","2019-08-27",null,null,{"$f":"IF(Table1[[#This Row],[First service received]]=1,\"Never dropped\",IF(Table1[[#This Row],[Enrolled]]=1,\"No first service\",IF(Table1[[#This Row],[Expressed interest]]=1,\"Not enrolled\",IF(Table1[[#This Row],[Eligible]]=1,\"Not interested\",IF(Table1[[#This Row],[Contacted]]=1,\"Not eligible\",IF(Table1[[#This Row],[Identified]]=1,\"Not contacted\",\"\"))))))","v":"Not interested"},{"$f":"_xlfn.CONCAT(Table1[[#This Row],[Reason not contacted]],Table1[[#This Row],[Reason not eligible]],Table1[[#This Row],[Reason not interested]],Table1[[#This Row],[Reason not enrolled]],Table1[[#This Row],[Reason first service not received]])","v":"Don't want to be in research study"}]
[1548,null,"25 to 44 yrs","M","Non-Hispanic/Latino","White","Yes","Yes","No","Not Employed","0 to 1","MSK","Work related","Workers comp","Industry 1","Occupation 1","Health provider","Clinic appointment schedules","County B","Other",1,0,"Inaccurate contact info",0,null,0,null,0,null,0,null,"2019-07-21",null,null,null,null,{"$f":"IF(Table1[[#This Row],[First service received]]=1,\"Never dropped\",IF(Table1[[#This Row],[Enrolled]]=1,\"No first service\",IF(Table1[[#This Row],[Expressed interest]]=1,\"Not enrolled\",IF(Table1[[#This Row],[Eligible]]=1,\"Not interested\",IF(Table1[[#This Row],[Contacted]]=1,\"Not eligible\",IF(Table1[[#This Row],[Identified]]=1,\"Not contacted\",\"\"))))))","v":"Not contacted"},{"$f":"_xlfn.CONCAT(Table1[[#This Row],[Reason not contacted]],Table1[[#This Row],[Reason not eligible]],Table1[[#This Row],[Reason not interested]],Table1[[#This Row],[Reason not enrolled]],Table1[[#This Row],[Reason first service not received]])","v":"Inaccurate contact info"}]
[1058,null,"25 to 44 yrs","F","Hispanic/Latino","White","Yes","Yes","No","Not Employed","0 to 1","MSK","Non-work related","Non-workers comp","Industry 3","Occupation 2","Health provider","Worker’s comp database","County B","Phone",1,1,null,0,"Ineligible reason1",0,null,0,null,0,null,"2019-07-22","2019-07-28","2019-08-29",null,null,{"$f":"IF(Table1[[#This Row],[First service received]]=1,\"Never dropped\",IF(Table1[[#This Row],[Enrolled]]=1,\"No first service\",IF(Table1[[#This Row],[Expressed interest]]=1,\"Not enrolled\",IF(Table1[[#This Row],[Eligible]]=1,\"Not interested\",IF(Table1[[#This Row],[Contacted]]=1,\"Not eligible\",IF(Table1[[#This Row],[Identified]]=1,\"Not contacted\",\"\"))))))","v":"Not eligible"},{"$f":"_xlfn.CONCAT(Table1[[#This Row],[Reason not contacted]],Table1[[#This Row],[Reason not eligible]],Table1[[#This Row],[Reason not interested]],Table1[[#This Row],[Reason not enrolled]],Table1[[#This Row],[Reason first service not received]])","v":"Ineligible reason1"}]
[1092,null,"18 to 24 yrs","F","Non-Hispanic/Latino","White","Yes","Yes","Yes","Not Employed","0 to 1","MSK","Non-work related","Non-workers comp","Industry 3","Occupation 2","Health provider","Worker’s comp database","County B","Other",1,0,"Inaccurate contact info",0,null,0,null,0,null,0,null,"2019-07-22",null,null,null,null,{"$f":"IF(Table1[[#This Row],[First service received]]=1,\"Never dropped\",IF(Table1[[#This Row],[Enrolled]]=1,\"No first service\",IF(Table1[[#This Row],[Expressed interest]]=1,\"Not enrolled\",IF(Table1[[#This Row],[Eligible]]=1,\"Not interested\",IF(Table1[[#This Row],[Contacted]]=1,\"Not eligible\",IF(Table1[[#This Row],[Identified]]=1,\"Not contacted\",\"\"))))))","v":"Not contacted"},{"$f":"_xlfn.CONCAT(Table1[[#This Row],[Reason not contacted]],Table1[[#This Row],[Reason not eligible]],Table1[[#This Row],[Reason not interested]],Table1[[#This Row],[Reason not enrolled]],Table1[[#This Row],[Reason first service not received]])","v":"Inaccurate contact info"}]
[1197,null,"25 to 44 yrs","F","Hispanic/Latino","White","Yes","Yes","No","Employed","7 to 12","Cardio or Respiratory","Work related","Workers comp","Industry 3","Occupation 2","Health provider","FMLA forms","County B","Phone",1,1,null,1,null,0,"Impact on provider relationship",0,null,0,null,"2019-07-22","2019-08-03","2019-08-11",null,null,{"$f":"IF(Table1[[#This Row],[First service received]]=1,\"Never dropped\",IF(Table1[[#This Row],[Enrolled]]=1,\"No first service\",IF(Table1[[#This Row],[Expressed interest]]=1,\"Not enrolled\",IF(Table1[[#This Row],[Eligible]]=1,\"Not interested\",IF(Table1[[#This Row],[Contacted]]=1,\"Not eligible\",IF(Table1[[#This Row],[Identified]]=1,\"Not contacted\",\"\"))))))","v":"Not interested"},{"$f":"_xlfn.CONCAT(Table1[[#This Row],[Reason not contacted]],Table1[[#This Row],[Reason not eligible]],Table1[[#This Row],[Reason not interested]],Table1[[#This Row],[Reason not enrolled]],Table1[[#This Row],[Reason first service not received]])","v":"Impact on provider relationship"}]
[1298,null,"45 to 64 yrs","F","Non-Hispanic/Latino","White","Yes","Yes","No","Employed","7 to 12","MSK","Non-work related","Non-workers comp","Industry 4","Occupation 1","Health provider","Worker’s comp database","County A","In person",1,0,"Contacted, no response",0,null,0,null,0,null,0,null,"2019-07-22",null,null,null,null,{"$f":"IF(Table1[[#This Row],[First service received]]=1,\"Never dropped\",IF(Table1[[#This Row],[Enrolled]]=1,\"No first service\",IF(Table1[[#This Row],[Expressed interest]]=1,\"Not enrolled\",IF(Table1[[#This Row],[Eligible]]=1,\"Not interested\",IF(Table1[[#This Row],[Contacted]]=1,\"Not eligible\",IF(Table1[[#This Row],[Identified]]=1,\"Not contacted\",\"\"))))))","v":"Not contacted"},{"$f":"_xlfn.CONCAT(Table1[[#This Row],[Reason not contacted]],Table1[[#This Row],[Reason not eligible]],Table1[[#This Row],[Reason not interested]],Table1[[#This Row],[Reason not enrolled]],Table1[[#This Row],[Reason first service not received]])","v":"Contacted, no response"}]
[1334,null,"25 to 44 yrs","M","Non-Hispanic/Latino","White","Yes","No","No","Employed","0 to 1","Other","Work related","Non-workers comp","Industry 2","Occupation 3","Health provider","Worker’s comp database","County B","In person",1,1,null,1,null,0,"Impact on provider relationship",0,null,0,null,"2019-07-22","2019-07-24","2019-08-12",null,null,{"$f":"IF(Table1[[#This Row],[First service received]]=1,\"Never dropped\",IF(Table1[[#This Row],[Enrolled]]=1,\"No first service\",IF(Table1[[#This Row],[Expressed interest]]=1,\"Not enrolled\",IF(Table1[[#This Row],[Eligible]]=1,\"Not interested\",IF(Table1[[#This Row],[Contacted]]=1,\"Not eligible\",IF(Table1[[#This Row],[Identified]]=1,\"Not contacted\",\"\"))))))","v":"Not interested"},{"$f":"_xlfn.CONCAT(Table1[[#This Row],[Reason not contacted]],Table1[[#This Row],[Reason not eligible]],Table1[[#This Row],[Reason not interested]],Table1[[#This Row],[Reason not enrolled]],Table1[[#This Row],[Reason first service not received]])","v":"Impact on provider relationship"}]
[1451,null,"45 to 64 yrs","M","Non-Hispanic/Latino","White","Yes","Yes","No","Employed","2 to 6","Other","Work related","Non-workers comp","Industry 3","Occupation 2","Health provider","Clinic appointment schedules","County B","Phone",1,0,"Contacted, no response",0,null,0,null,0,null,0,null,"2019-07-22",null,null,null,null,{"$f":"IF(Table1[[#This Row],[First service received]]=1,\"Never dropped\",IF(Table1[[#This Row],[Enrolled]]=1,\"No first service\",IF(Table1[[#This Row],[Expressed interest]]=1,\"Not enrolled\",IF(Table1[[#This Row],[Eligible]]=1,\"Not interested\",IF(Table1[[#This Row],[Contacted]]=1,\"Not eligible\",IF(Table1[[#This Row],[Identified]]=1,\"Not contacted\",\"\"))))))","v":"Not contacted"},{"$f":"_xlfn.CONCAT(Table1[[#This Row],[Reason not contacted]],Table1[[#This Row],[Reason not eligible]],Table1[[#This Row],[Reason not interested]],Table1[[#This Row],[Reason not enrolled]],Table1[[#This Row],[Reason first service not received]])","v":"Contacted, no response"}]
[1514,null,"25 to 44 yrs","M","Non-Hispanic/Latino","White","No","Yes","No","Employed","2 to 6","MSK","Non-work related","Non-workers comp","Industry 3","Occupation 2","Health provider","Clinic appointment schedules","County B","Email",1,1,null,0,"Ineligible reason3",0,null,0,null,0,null,"2019-07-22","2019-07-28","2019-09-08",null,null,{"$f":"IF(Table1[[#This Row],[First service received]]=1,\"Never dropped\",IF(Table1[[#This Row],[Enrolled]]=1,\"No first service\",IF(Table1[[#This Row],[Expressed interest]]=1,\"Not enrolled\",IF(Table1[[#This Row],[Eligible]]=1,\"Not interested\",IF(Table1[[#This Row],[Contacted]]=1,\"Not eligible\",IF(Table1[[#This Row],[Identified]]=1,\"Not contacted\",\"\"))))))","v":"Not eligible"},{"$f":"_xlfn.CONCAT(Table1[[#This Row],[Reason not contacted]],Table1[[#This Row],[Reason not eligible]],Table1[[#This Row],[Reason not interested]],Table1[[#This Row],[Reason not enrolled]],Table1[[#This Row],[Reason first service not received]])","v":"Ineligible reason3"}]
[1596,null,"25 to 44 yrs","F","Non-Hispanic/Latino","Hawaiian or Pacific Islander","Yes","Yes","No","Employed","7 to 12","MSK","Non-work related","Non-workers comp","Industry 3","Occupation 2","Health provider","Voc rehab centers","County B","Phone",1,1,null,1,null,1,null,1,null,1,null,"2019-07-22","2019-08-02","2019-08-05","2019-08-25","2019-09-08",{"$f":"IF(Table1[[#This Row],[First service received]]=1,\"Never dropped\",IF(Table1[[#This Row],[Enrolled]]=1,\"No first service\",IF(Table1[[#This Row],[Expressed interest]]=1,\"Not enrolled\",IF(Table1[[#This Row],[Eligible]]=1,\"Not interested\",IF(Table1[[#This Row],[Contacted]]=1,\"Not eligible\",IF(Table1[[#This Row],[Identified]]=1,\"Not contacted\",\"\"))))))","v":"Never dropped"},{"$f":"_xlfn.CONCAT(Table1[[#This Row],[Reason not contacted]],Table1[[#This Row],[Reason not eligible]],Table1[[#This Row],[Reason not interested]],Table1[[#This Row],[Reason not enrolled]],Table1[[#This Row],[Reason first service not received]])","v":""}]
[1114,null,"45 to 64 yrs","F","Non-Hispanic/Latino","Black or African-American","Yes","Yes","No","Employed","2 to 6","Other","Work related","Workers comp","Industry 3","Occupation 1","Health provider","Clinic appointment schedules","County B","Phone",1,1,null,1,null,0,"Don't want to be in research study",0,null,0,null,"2019-07-23","2019-08-05","2019-08-31",null,null,{"$f":"IF(Table1[[#This Row],[First service received]]=1,\"Never dropped\",IF(Table1[[#This Row],[Enrolled]]=1,\"No first service\",IF(Table1[[#This Row],[Expressed interest]]=1,\"Not enrolled\",IF(Table1[[#This Row],[Eligible]]=1,\"Not interested\",IF(Table1[[#This Row],[Contacted]]=1,\"Not eligible\",IF(Table1[[#This Row],[Identified]]=1,\"Not contacted\",\"\"))))))","v":"Not interested"},{"$f":"_xlfn.CONCAT(Table1[[#This Row],[Reason not contacted]],Table1[[#This Row],[Reason not eligible]],Table1[[#This Row],[Reason not interested]],Table1[[#This Row],[Reason not enrolled]],Table1[[#This Row],[Reason first service not received]])","v":"Don't want to be in research study"}]
[1222,null,"25 to 44 yrs","F","Non-Hispanic/Latino","American Indian or Alaska Native","Yes","Yes","No","Not Employed","0 to 1","MSK","Non-work related","Non-workers comp","Industry 1","Occupation 3","Employer","Electronic Health Records","County B","Phone",1,1,null,0,"Ineligible reason1",0,null,0,null,0,null,"2019-07-23","2019-07-24","2019-08-25",null,null,{"$f":"IF(Table1[[#This Row],[First service received]]=1,\"Never dropped\",IF(Table1[[#This Row],[Enrolled]]=1,\"No first service\",IF(Table1[[#This Row],[Expressed interest]]=1,\"Not enrolled\",IF(Table1[[#This Row],[Eligible]]=1,\"Not interested\",IF(Table1[[#This Row],[Contacted]]=1,\"Not eligible\",IF(Table1[[#This Row],[Identified]]=1,\"Not contacted\",\"\"))))))","v":"Not eligible"},{"$f":"_xlfn.CONCAT(Table1[[#This Row],[Reason not contacted]],Table1[[#This Row],[Reason not eligible]],Table1[[#This Row],[Reason not interested]],Table1[[#This Row],[Reason not enrolled]],Table1[[#This Row],[Reason first service not received]])","v":"Ineligible reason1"}]
[1389,null,"25 to 44 yrs","M","Hispanic/Latino","White","Yes","Yes","No","Employed","0 to 1","MSK","Work related","Workers comp","Industry 4","Occupation 3","Health provider","Clinic appointment schedules","County B","Phone",1,1,null,1,null,0,"Don't want to be in research study",0,null,0,null,"2019-07-23","2019-08-05","2019-08-16",null,null,{"$f":"IF(Table1[[#This Row],[First service received]]=1,\"Never dropped\",IF(Table1[[#This Row],[Enrolled]]=1,\"No first service\",IF(Table1[[#This Row],[Expressed interest]]=1,\"Not enrolled\",IF(Table1[[#This Row],[Eligible]]=1,\"Not interested\",IF(Table1[[#This Row],[Contacted]]=1,\"Not eligible\",IF(Table1[[#This Row],[Identified]]=1,\"Not contacted\",\"\"))))))","v":"Not interested"},{"$f":"_xlfn.CONCAT(Table1[[#This Row],[Reason not contacted]],Table1[[#This Row],[Reason not eligible]],Table1[[#This Row],[Reason not interested]],Table1[[#This Row],[Reason not enrolled]],Table1[[#This Row],[Reason first service not received]])","v":"Don't want to be in research study"}]
[1620,null,"65 yrs +","M","Non-Hispanic/Latino","White","Yes","Yes","No","Employed","0 to 1","MSK","Non-work related","Non-workers comp","Industry 3","Occupation 2","Employer","Electronic Health Records","County B","Phone",1,1,null,1,null,1,null,1,null,1,null,"2019-07-23","2019-07-31","2019-08-10","2019-08-22","2019-09-05",{"$f":"IF(Table1[[#This Row],[First service received]]=1,\"Never dropped\",IF(Table1[[#This Row],[Enrolled]]=1,\"No first service\",IF(Table1[[#This Row],[Expressed interest]]=1,\"Not enrolled\",IF(Table1[[#This Row],[Eligible]]=1,\"Not interested\",IF(Table1[[#This Row],[Contacted]]=1,\"Not eligible\",IF(Table1[[#This Row],[Identified]]=1,\"Not contacted\",\"\"))))))","v":"Never dropped"},{"$f":"_xlfn.CONCAT(Table1[[#This Row],[Reason not contacted]],Table1[[#This Row],[Reason not eligible]],Table1[[#This Row],[Reason not interested]],Table1[[#This Row],[Reason not enrolled]],Table1[[#This Row],[Reason first service not received]])","v":""}]
[1276,null,"25 to 44 yrs","M","Non-Hispanic/Latino","White","Yes","Yes","No","Employed","2 to 6","MSK","Non-work related","Non-workers comp","Industry 1","Occupation 1","Health provider","Clinic appointment schedules","County B","Phone",1,0,"Contacted, no response",0,null,0,null,0,null,0,null,"2019-07-24",null,null,null,null,{"$f":"IF(Table1[[#This Row],[First service received]]=1,\"Never dropped\",IF(Table1[[#This Row],[Enrolled]]=1,\"No first service\",IF(Table1[[#This Row],[Expressed interest]]=1,\"Not enrolled\",IF(Table1[[#This Row],[Eligible]]=1,\"Not interested\",IF(Table1[[#This Row],[Contacted]]=1,\"Not eligible\",IF(Table1[[#This Row],[Identified]]=1,\"Not contacted\",\"\"))))))","v":"Not contacted"},{"$f":"_xlfn.CONCAT(Table1[[#This Row],[Reason not contacted]],Table1[[#This Row],[Reason not eligible]],Table1[[#This Row],[Reason not interested]],Table1[[#This Row],[Reason not enrolled]],Table1[[#This Row],[Reason first service not received]])","v":"Contacted, no response"}]
[1286,null,"25 to 44 yrs","M","Non-Hispanic/Latino","White","Yes","Yes","No","Employed","7 to 12","MSK","Non-work related","Non-workers comp","Industry 2","Occupation 1","Workforce partner","Electronic Health Records","County B","Phone",1,0,"Contacted, no response",0,null,0,null,0,null,0,null,"2019-07-24",null,null,null,null,{"$f":"IF(Table1[[#This Row],[First service received]]=1,\"Never dropped\",IF(Table1[[#This Row],[Enrolled]]=1,\"No first service\",IF(Table1[[#This Row],[Expressed interest]]=1,\"Not enrolled\",IF(Table1[[#This Row],[Eligible]]=1,\"Not interested\",IF(Table1[[#This Row],[Contacted]]=1,\"Not eligible\",IF(Table1[[#This Row],[Identified]]=1,\"Not contacted\",\"\"))))))","v":"Not contacted"},{"$f":"_xlfn.CONCAT(Table1[[#This Row],[Reason not contacted]],Table1[[#This Row],[Reason not eligible]],Table1[[#This Row],[Reason not interested]],Table1[[#This Row],[Reason not enrolled]],Table1[[#This Row],[Reason first service not received]])","v":"Contacted, no response"}]
[1373,null,"25 to 44 yrs","F","Non-Hispanic/Latino","White","Yes","Yes","No","Employed","2 to 6","Other","Work related","Non-workers comp","Industry 4","Occupation 4","Health provider","FMLA forms","County B","Phone",1,1,null,1,null,0,"Impact on provider relationship",0,null,0,null,"2019-07-24","2019-07-27","2019-08-23",null,null,{"$f":"IF(Table1[[#This Row],[First service received]]=1,\"Never dropped\",IF(Table1[[#This Row],[Enrolled]]=1,\"No first service\",IF(Table1[[#This Row],[Expressed interest]]=1,\"Not enrolled\",IF(Table1[[#This Row],[Eligible]]=1,\"Not interested\",IF(Table1[[#This Row],[Contacted]]=1,\"Not eligible\",IF(Table1[[#This Row],[Identified]]=1,\"Not contacted\",\"\"))))))","v":"Not interested"},{"$f":"_xlfn.CONCAT(Table1[[#This Row],[Reason not contacted]],Table1[[#This Row],[Reason not eligible]],Table1[[#This Row],[Reason not interested]],Table1[[#This Row],[Reason not enrolled]],Table1[[#This Row],[Reason first service not received]])","v":"Impact on provider relationship"}]
[1374,null,"45 to 64 yrs","M","Non-Hispanic/Latino","White","Yes","Yes","No","Employed","7 to 12","MSK","Work related","Non-workers comp","Industry 3","Occupation 1","Health provider","Voc rehab centers","County B","Phone",1,0,"Contacted, no response",0,null,0,null,0,null,0,null,"2019-07-24",null,null,null,null,{"$f":"IF(Table1[[#This Row],[First service received]]=1,\"Never dropped\",IF(Table1[[#This Row],[Enrolled]]=1,\"No first service\",IF(Table1[[#This Row],[Expressed interest]]=1,\"Not enrolled\",IF(Table1[[#This Row],[Eligible]]=1,\"Not interested\",IF(Table1[[#This Row],[Contacted]]=1,\"Not eligible\",IF(Table1[[#This Row],[Identified]]=1,\"Not contacted\",\"\"))))))","v":"Not contacted"},{"$f":"_xlfn.CONCAT(Table1[[#This Row],[Reason not contacted]],Table1[[#This Row],[Reason not eligible]],Table1[[#This Row],[Reason not interested]],Table1[[#This Row],[Reason not enrolled]],Table1[[#This Row],[Reason first service not received]])","v":"Contacted, no response"}]
[1488,null,"25 to 44 yrs","M","Non-Hispanic/Latino","White","No","Yes","No","Employed","13+ weeks","Other","Work related","Workers comp","Industry 3","Occupation 2","Health provider","Worker’s comp database","County A","Phone",1,1,null,0,"Ineligible reason3",0,null,0,null,0,null,"2019-07-24","2019-08-03","2019-08-10",null,null,{"$f":"IF(Table1[[#This Row],[First service received]]=1,\"Never dropped\",IF(Table1[[#This Row],[Enrolled]]=1,\"No first service\",IF(Table1[[#This Row],[Expressed interest]]=1,\"Not enrolled\",IF(Table1[[#This Row],[Eligible]]=1,\"Not interested\",IF(Table1[[#This Row],[Contacted]]=1,\"Not eligible\",IF(Table1[[#This Row],[Identified]]=1,\"Not contacted\",\"\"))))))","v":"Not eligible"},{"$f":"_xlfn.CONCAT(Table1[[#This Row],[Reason not contacted]],Table1[[#This Row],[Reason not eligible]],Table1[[#This Row],[Reason not interested]],Table1[[#This Row],[Reason not enrolled]],Table1[[#This Row],[Reason first service not received]])","v":"Ineligible reason3"}]
[1529,null,"25 to 44 yrs","F","Non-Hispanic/Latino","White","Yes","Yes","Yes","Self-employed","13+ weeks","Cardio or Respiratory","Non-work related","Non-workers comp","Industry 2","Occupation 1","Health provider","Work restriction forms","County C","Email",1,1,null,1,null,1,null,1,null,1,null,"2019-07-24","2019-07-25","2019-08-06","2019-08-21","2019-08-23",{"$f":"IF(Table1[[#This Row],[First service received]]=1,\"Never dropped\",IF(Table1[[#This Row],[Enrolled]]=1,\"No first service\",IF(Table1[[#This Row],[Expressed interest]]=1,\"Not enrolled\",IF(Table1[[#This Row],[Eligible]]=1,\"Not interested\",IF(Table1[[#This Row],[Contacted]]=1,\"Not eligible\",IF(Table1[[#This Row],[Identified]]=1,\"Not contacted\",\"\"))))))","v":"Never dropped"},{"$f":"_xlfn.CONCAT(Table1[[#This Row],[Reason not contacted]],Table1[[#This Row],[Reason not eligible]],Table1[[#This Row],[Reason not interested]],Table1[[#This Row],[Reason not enrolled]],Table1[[#This Row],[Reason first service not received]])","v":""}]
[1531,null,"18 to 24 yrs","F","Non-Hispanic/Latino","Black or African-American","Yes","Yes","No","Employed","7 to 12","MSK","Work related","Workers comp","Industry 4","Occupation 4","Health provider","FMLA forms","County B","In person",1,1,null,1,null,1,null,1,null,1,null,"2019-07-24","2019-07-26","2019-07-29","2019-08-11","2019-08-24",{"$f":"IF(Table1[[#This Row],[First service received]]=1,\"Never dropped\",IF(Table1[[#This Row],[Enrolled]]=1,\"No first service\",IF(Table1[[#This Row],[Expressed interest]]=1,\"Not enrolled\",IF(Table1[[#This Row],[Eligible]]=1,\"Not interested\",IF(Table1[[#This Row],[Contacted]]=1,\"Not eligible\",IF(Table1[[#This Row],[Identified]]=1,\"Not contacted\",\"\"))))))","v":"Never dropped"},{"$f":"_xlfn.CONCAT(Table1[[#This Row],[Reason not contacted]],Table1[[#This Row],[Reason not eligible]],Table1[[#This Row],[Reason not interested]],Table1[[#This Row],[Reason not enrolled]],Table1[[#This Row],[Reason first service not received]])","v":""}]
[1014,null,"25 to 44 yrs","F","Non-Hispanic/Latino","White","No","No","No","Employed","7 to 12","MSK","Work related","Workers comp","Industry 3","Occupation 2","Workforce partner","Electronic Health Records","County B","Phone",1,1,null,0,"Ineligible reason1",0,null,0,null,0,null,"2019-07-25","2019-07-28","2019-08-28",null,null,{"$f":"IF(Table1[[#This Row],[First service received]]=1,\"Never dropped\",IF(Table1[[#This Row],[Enrolled]]=1,\"No first service\",IF(Table1[[#This Row],[Expressed interest]]=1,\"Not enrolled\",IF(Table1[[#This Row],[Eligible]]=1,\"Not interested\",IF(Table1[[#This Row],[Contacted]]=1,\"Not eligible\",IF(Table1[[#This Row],[Identified]]=1,\"Not contacted\",\"\"))))))","v":"Not eligible"},{"$f":"_xlfn.CONCAT(Table1[[#This Row],[Reason not contacted]],Table1[[#This Row],[Reason not eligible]],Table1[[#This Row],[Reason not interested]],Table1[[#This Row],[Reason not enrolled]],Table1[[#This Row],[Reason first service not received]])","v":"Ineligible reason1"}]
[1049,null,"18 to 24 yrs","M","Non-Hispanic/Latino","White","Yes","Yes","No","Not Employed","0 to 1","Other","Work related","Workers comp","Industry 3","Occupation 2","Employer","Electronic Health Records","County B","Phone",1,1,null,1,null,0,"Impact on provider relationship",0,null,0,null,"2019-07-25","2019-08-06","2019-09-14",null,null,{"$f":"IF(Table1[[#This Row],[First service received]]=1,\"Never dropped\",IF(Table1[[#This Row],[Enrolled]]=1,\"No first service\",IF(Table1[[#This Row],[Expressed interest]]=1,\"Not enrolled\",IF(Table1[[#This Row],[Eligible]]=1,\"Not interested\",IF(Table1[[#This Row],[Contacted]]=1,\"Not eligible\",IF(Table1[[#This Row],[Identified]]=1,\"Not contacted\",\"\"))))))","v":"Not interested"},{"$f":"_xlfn.CONCAT(Table1[[#This Row],[Reason not contacted]],Table1[[#This Row],[Reason not eligible]],Table1[[#This Row],[Reason not interested]],Table1[[#This Row],[Reason not enrolled]],Table1[[#This Row],[Reason first service not received]])","v":"Impact on provider relationship"}]
[1053,null,"45 to 64 yrs","M","Non-Hispanic/Latino","Black or African-American","No","Yes","No","Employed","0 to 1","MSK","Work related","Non-workers comp","Industry 3","Occupation 2","Health provider","Clinic appointment schedules","County A","Phone",1,0,"Contacted, no response",0,null,0,null,0,null,0,null,"2019-07-25",null,null,null,null,{"$f":"IF(Table1[[#This Row],[First service received]]=1,\"Never dropped\",IF(Table1[[#This Row],[Enrolled]]=1,\"No first service\",IF(Table1[[#This Row],[Expressed interest]]=1,\"Not enrolled\",IF(Table1[[#This Row],[Eligible]]=1,\"Not interested\",IF(Table1[[#This Row],[Contacted]]=1,\"Not eligible\",IF(Table1[[#This Row],[Identified]]=1,\"Not contacted\",\"\"))))))","v":"Not contacted"},{"$f":"_xlfn.CONCAT(Table1[[#This Row],[Reason not contacted]],Table1[[#This Row],[Reason not eligible]],Table1[[#This Row],[Reason not interested]],Table1[[#This Row],[Reason not enrolled]],Table1[[#This Row],[Reason first service not received]])","v":"Contacted, no response"}]
[1064,null,"25 to 44 yrs","F","Non-Hispanic/Latino","White","Yes","Yes","No","Employed","2 to 6","MSK","Non-work related","Non-workers comp","Industry 1","Occupation 3","Health provider","Worker’s comp database","County B","Email",1,1,null,1,null,0,"Impact on provider relationship",0,null,0,null,"2019-07-25","2019-07-26","2019-08-11",null,null,{"$f":"IF(Table1[[#This Row],[First service received]]=1,\"Never dropped\",IF(Table1[[#This Row],[Enrolled]]=1,\"No first service\",IF(Table1[[#This Row],[Expressed interest]]=1,\"Not enrolled\",IF(Table1[[#This Row],[Eligible]]=1,\"Not interested\",IF(Table1[[#This Row],[Contacted]]=1,\"Not eligible\",IF(Table1[[#This Row],[Identified]]=1,\"Not contacted\",\"\"))))))","v":"Not interested"},{"$f":"_xlfn.CONCAT(Table1[[#This Row],[Reason not contacted]],Table1[[#This Row],[Reason not eligible]],Table1[[#This Row],[Reason not interested]],Table1[[#This Row],[Reason not enrolled]],Table1[[#This Row],[Reason first service not received]])","v":"Impact on provider relationship"}]
[1312,null,"45 to 64 yrs","M","Non-Hispanic/Latino","American Indian or Alaska Native","Yes","Yes","No","Employed","2 to 6","MSK","Non-work related","Non-workers comp","Industry 3","Occupation 1","Health provider","Worker’s comp database","County B","Other",1,0,"Inaccurate contact info",0,null,0,null,0,null,0,null,"2019-07-25",null,null,null,null,{"$f":"IF(Table1[[#This Row],[First service received]]=1,\"Never dropped\",IF(Table1[[#This Row],[Enrolled]]=1,\"No first service\",IF(Table1[[#This Row],[Expressed interest]]=1,\"Not enrolled\",IF(Table1[[#This Row],[Eligible]]=1,\"Not interested\",IF(Table1[[#This Row],[Contacted]]=1,\"Not eligible\",IF(Table1[[#This Row],[Identified]]=1,\"Not contacted\",\"\"))))))","v":"Not contacted"},{"$f":"_xlfn.CONCAT(Table1[[#This Row],[Reason not contacted]],Table1[[#This Row],[Reason not eligible]],Table1[[#This Row],[Reason not interested]],Table1[[#This Row],[Reason not enrolled]],Table1[[#This Row],[Reason first service not received]])","v":"Inaccurate contact info"}]
[1332,null,"18 to 24 yrs","F","Non-Hispanic/Latino","Asian","Yes","Yes","No","Employed","7 to 12","MSK","Work related","Non-workers comp","Industry 2","Occupation 3","Health provider","Voc rehab centers","County B","In person",1,1,null,1,null,1,null,1,null,1,null,"2019-07-25","2019-08-08","2019-08-09","2019-09-01","2019-09-06",{"$f":"IF(Table1[[#This Row],[First service received]]=1,\"Never dropped\",IF(Table1[[#This Row],[Enrolled]]=1,\"No first service\",IF(Table1[[#This Row],[Expressed interest]]=1,\"Not enrolled\",IF(Table1[[#This Row],[Eligible]]=1,\"Not interested\",IF(Table1[[#This Row],[Contacted]]=1,\"Not eligible\",IF(Table1[[#This Row],[Identified]]=1,\"Not contacted\",\"\"))))))","v":"Never dropped"},{"$f":"_xlfn.CONCAT(Table1[[#This Row],[Reason not contacted]],Table1[[#This Row],[Reason not eligible]],Table1[[#This Row],[Reason not interested]],Table1[[#This Row],[Reason not enrolled]],Table1[[#This Row],[Reason first service not received]])","v":""}]
[1441,null,"25 to 44 yrs","F","Non-Hispanic/Latino","Black or African-American","Yes","Yes","Yes","Employed","2 to 6","MSK","Non-work related","Non-workers comp","Industry 3","Occupation 3","Employer","Electronic Health Records","County B","Phone",1,1,null,0,"Ineligible reason1",0,null,0,null,0,null,"2019-07-25","2019-08-01","2019-08-06",null,null,{"$f":"IF(Table1[[#This Row],[First service received]]=1,\"Never dropped\",IF(Table1[[#This Row],[Enrolled]]=1,\"No first service\",IF(Table1[[#This Row],[Expressed interest]]=1,\"Not enrolled\",IF(Table1[[#This Row],[Eligible]]=1,\"Not interested\",IF(Table1[[#This Row],[Contacted]]=1,\"Not eligible\",IF(Table1[[#This Row],[Identified]]=1,\"Not contacted\",\"\"))))))","v":"Not eligible"},{"$f":"_xlfn.CONCAT(Table1[[#This Row],[Reason not contacted]],Table1[[#This Row],[Reason not eligible]],Table1[[#This Row],[Reason not interested]],Table1[[#This Row],[Reason not enrolled]],Table1[[#This Row],[Reason first service not received]])","v":"Ineligible reason1"}]
[1457,null,"25 to 44 yrs","M","Non-Hispanic/Latino","White","Yes","Yes","No","Not Employed","0 to 1","Other","Non-work related","Non-workers comp","Industry 2","Occupation 3","Health provider","Worker’s comp database","County B","In person",1,1,null,1,null,0,"Impact on provider relationship",0,null,0,null,"2019-07-26","2019-08-07","2019-09-17",null,null,{"$f":"IF(Table1[[#This Row],[First service received]]=1,\"Never dropped\",IF(Table1[[#This Row],[Enrolled]]=1,\"No first service\",IF(Table1[[#This Row],[Expressed interest]]=1,\"Not enrolled\",IF(Table1[[#This Row],[Eligible]]=1,\"Not interested\",IF(Table1[[#This Row],[Contacted]]=1,\"Not eligible\",IF(Table1[[#This Row],[Identified]]=1,\"Not contacted\",\"\"))))))","v":"Not interested"},{"$f":"_xlfn.CONCAT(Table1[[#This Row],[Reason not contacted]],Table1[[#This Row],[Reason not eligible]],Table1[[#This Row],[Reason not interested]],Table1[[#This Row],[Reason not enrolled]],Table1[[#This Row],[Reason first service not received]])","v":"Impact on provider relationship"}]
[1588,null,"45 to 64 yrs","F","Non-Hispanic/Latino","White","Yes","Yes","No","Employed","13+ weeks","MSK","Non-work related","Non-workers comp","Industry 3","Occupation 3","Workforce partner","Electronic Health Records","County B","Phone",1,1,null,1,null,0,"Don't want to be in research study",0,null,0,null,"2019-07-26","2019-08-07","2019-08-12",null,null,{"$f":"IF(Table1[[#This Row],[First service received]]=1,\"Never dropped\",IF(Table1[[#This Row],[Enrolled]]=1,\"No first service\",IF(Table1[[#This Row],[Expressed interest]]=1,\"Not enrolled\",IF(Table1[[#This Row],[Eligible]]=1,\"Not interested\",IF(Table1[[#This Row],[Contacted]]=1,\"Not eligible\",IF(Table1[[#This Row],[Identified]]=1,\"Not contacted\",\"\"))))))","v":"Not interested"},{"$f":"_xlfn.CONCAT(Table1[[#This Row],[Reason not contacted]],Table1[[#This Row],[Reason not eligible]],Table1[[#This Row],[Reason not interested]],Table1[[#This Row],[Reason not enrolled]],Table1[[#This Row],[Reason first service not received]])","v":"Don't want to be in research study"}]
[1616,null,"45 to 64 yrs","F","Non-Hispanic/Latino","White","No","Yes","No","Employed","2 to 6","MSK","Non-work related","Non-workers comp","Industry 4","Occupation 3","Health provider","Clinic appointment schedules","County B","Phone",1,1,null,1,null,1,null,1,null,1,null,"2019-07-26","2019-08-07","2019-08-13","2019-09-06","2019-09-19",{"$f":"IF(Table1[[#This Row],[First service received]]=1,\"Never dropped\",IF(Table1[[#This Row],[Enrolled]]=1,\"No first service\",IF(Table1[[#This Row],[Expressed interest]]=1,\"Not enrolled\",IF(Table1[[#This Row],[Eligible]]=1,\"Not interested\",IF(Table1[[#This Row],[Contacted]]=1,\"Not eligible\",IF(Table1[[#This Row],[Identified]]=1,\"Not contacted\",\"\"))))))","v":"Never dropped"},{"$f":"_xlfn.CONCAT(Table1[[#This Row],[Reason not contacted]],Table1[[#This Row],[Reason not eligible]],Table1[[#This Row],[Reason not interested]],Table1[[#This Row],[Reason not enrolled]],Table1[[#This Row],[Reason first service not received]])","v":""}]
[1320,null,"45 to 64 yrs","F","Non-Hispanic/Latino","Black or African-American","No","Yes","No","Self-employed","13+ weeks","Other","Work related","Workers comp","Industry 3","Occupation 3","Health provider","Clinic appointment schedules","County C","Phone",1,1,null,1,null,1,null,1,null,1,null,"2019-07-27","2019-07-28","2019-07-30","2019-08-22","2019-08-29",{"$f":"IF(Table1[[#This Row],[First service received]]=1,\"Never dropped\",IF(Table1[[#This Row],[Enrolled]]=1,\"No first service\",IF(Table1[[#This Row],[Expressed interest]]=1,\"Not enrolled\",IF(Table1[[#This Row],[Eligible]]=1,\"Not interested\",IF(Table1[[#This Row],[Contacted]]=1,\"Not eligible\",IF(Table1[[#This Row],[Identified]]=1,\"Not contacted\",\"\"))))))","v":"Never dropped"},{"$f":"_xlfn.CONCAT(Table1[[#This Row],[Reason not contacted]],Table1[[#This Row],[Reason not eligible]],Table1[[#This Row],[Reason not interested]],Table1[[#This Row],[Reason not enrolled]],Table1[[#This Row],[Reason first service not received]])","v":""}]
[1324,null,"18 to 24 yrs","F","Non-Hispanic/Latino","White","Yes","Yes","No","Employed","2 to 6","MSK","Non-work related","Non-workers comp","Industry 3","Occupation 2","Self","Electronic Health Records","County A","Phone",1,1,null,1,null,1,null,0,"Circumstances changed",0,null,"2019-07-27","2019-07-31","2019-08-18",null,null,{"$f":"IF(Table1[[#This Row],[First service received]]=1,\"Never dropped\",IF(Table1[[#This Row],[Enrolled]]=1,\"No first service\",IF(Table1[[#This Row],[Expressed interest]]=1,\"Not enrolled\",IF(Table1[[#This Row],[Eligible]]=1,\"Not interested\",IF(Table1[[#This Row],[Contacted]]=1,\"Not eligible\",IF(Table1[[#This Row],[Identified]]=1,\"Not contacted\",\"\"))))))","v":"Not enrolled"},{"$f":"_xlfn.CONCAT(Table1[[#This Row],[Reason not contacted]],Table1[[#This Row],[Reason not eligible]],Table1[[#This Row],[Reason not interested]],Table1[[#This Row],[Reason not enrolled]],Table1[[#This Row],[Reason first service not received]])","v":"Circumstances changed"}]
[1433,null,"25 to 44 yrs","M","Non-Hispanic/Latino","White","Yes","Yes","No","Employed","7 to 12","MSK","Non-work related","Non-workers comp","Industry 2","Occupation 3","Self","Electronic Health Records","County A","Phone",1,1,null,1,null,1,null,0,"Circumstances changed",0,null,"2019-07-27","2019-08-10","2019-09-18",null,null,{"$f":"IF(Table1[[#This Row],[First service received]]=1,\"Never dropped\",IF(Table1[[#This Row],[Enrolled]]=1,\"No first service\",IF(Table1[[#This Row],[Expressed interest]]=1,\"Not enrolled\",IF(Table1[[#This Row],[Eligible]]=1,\"Not interested\",IF(Table1[[#This Row],[Contacted]]=1,\"Not eligible\",IF(Table1[[#This Row],[Identified]]=1,\"Not contacted\",\"\"))))))","v":"Not enrolled"},{"$f":"_xlfn.CONCAT(Table1[[#This Row],[Reason not contacted]],Table1[[#This Row],[Reason not eligible]],Table1[[#This Row],[Reason not interested]],Table1[[#This Row],[Reason not enrolled]],Table1[[#This Row],[Reason first service not received]])","v":"Circumstances changed"}]
[1512,null,"45 to 64 yrs","F","Non-Hispanic/Latino","Black or African-American","Yes","Yes","No","Not Employed","0 to 1","MSK","Non-work related","Non-workers comp","Industry 3","Occupation 1","Self","Electronic Health Records","County B","Phone",1,1,null,1,null,1,null,0,"Not enrolled reason1",0,null,"2019-07-27","2019-08-09","2019-09-09",null,null,{"$f":"IF(Table1[[#This Row],[First service received]]=1,\"Never dropped\",IF(Table1[[#This Row],[Enrolled]]=1,\"No first service\",IF(Table1[[#This Row],[Expressed interest]]=1,\"Not enrolled\",IF(Table1[[#This Row],[Eligible]]=1,\"Not interested\",IF(Table1[[#This Row],[Contacted]]=1,\"Not eligible\",IF(Table1[[#This Row],[Identified]]=1,\"Not contacted\",\"\"))))))","v":"Not enrolled"},{"$f":"_xlfn.CONCAT(Table1[[#This Row],[Reason not contacted]],Table1[[#This Row],[Reason not eligible]],Table1[[#This Row],[Reason not interested]],Table1[[#This Row],[Reason not enrolled]],Table1[[#This Row],[Reason first service not received]])","v":"Not enrolled reason1"}]
[1537,null,"25 to 44 yrs","F","Non-Hispanic/Latino","White","Yes","Yes","No","Employed","13+ weeks","MSK","Work related","Non-workers comp","Industry 3","Occupation 3","Health provider","Clinic appointment schedules","County B","In person",1,1,null,1,null,0,"Impact on provider relationship",0,null,0,null,"2019-07-27","2019-08-11","2019-08-12",null,null,{"$f":"IF(Table1[[#This Row],[First service received]]=1,\"Never dropped\",IF(Table1[[#This Row],[Enrolled]]=1,\"No first service\",IF(Table1[[#This Row],[Expressed interest]]=1,\"Not enrolled\",IF(Table1[[#This Row],[Eligible]]=1,\"Not interested\",IF(Table1[[#This Row],[Contacted]]=1,\"Not eligible\",IF(Table1[[#This Row],[Identified]]=1,\"Not contacted\",\"\"))))))","v":"Not interested"},{"$f":"_xlfn.CONCAT(Table1[[#This Row],[Reason not contacted]],Table1[[#This Row],[Reason not eligible]],Table1[[#This Row],[Reason not interested]],Table1[[#This Row],[Reason not enrolled]],Table1[[#This Row],[Reason first service not received]])","v":"Impact on provider relationship"}]
[1089,null,"25 to 44 yrs","F","Non-Hispanic/Latino","White","Yes","Yes","No","Employed","2 to 6","MSK","Non-work related","Non-workers comp","Industry 1","Occupation 3","Health provider","Worker’s comp database","County B","In person",1,1,null,1,null,1,null,0,"Circumstances changed",0,null,"2019-07-28","2019-08-01","2019-08-13",null,null,{"$f":"IF(Table1[[#This Row],[First service received]]=1,\"Never dropped\",IF(Table1[[#This Row],[Enrolled]]=1,\"No first service\",IF(Table1[[#This Row],[Expressed interest]]=1,\"Not enrolled\",IF(Table1[[#This Row],[Eligible]]=1,\"Not interested\",IF(Table1[[#This Row],[Contacted]]=1,\"Not eligible\",IF(Table1[[#This Row],[Identified]]=1,\"Not contacted\",\"\"))))))","v":"Not enrolled"},{"$f":"_xlfn.CONCAT(Table1[[#This Row],[Reason not contacted]],Table1[[#This Row],[Reason not eligible]],Table1[[#This Row],[Reason not interested]],Table1[[#This Row],[Reason not enrolled]],Table1[[#This Row],[Reason first service not received]])","v":"Circumstances changed"}]
[1382,null,"25 to 44 yrs","F","Non-Hispanic/Latino","White","Yes","Yes","No","Employed","7 to 12","MSK","Non-work related","Non-workers comp","Industry 3","Occupation 2","Employer","Electronic Health Records","County B","Phone",1,1,null,1,null,0,"Impact on provider relationship",0,null,0,null,"2019-07-28","2019-08-08","2019-09-06",null,null,{"$f":"IF(Table1[[#This Row],[First service received]]=1,\"Never dropped\",IF(Table1[[#This Row],[Enrolled]]=1,\"No first service\",IF(Table1[[#This Row],[Expressed interest]]=1,\"Not enrolled\",IF(Table1[[#This Row],[Eligible]]=1,\"Not interested\",IF(Table1[[#This Row],[Contacted]]=1,\"Not eligible\",IF(Table1[[#This Row],[Identified]]=1,\"Not contacted\",\"\"))))))","v":"Not interested"},{"$f":"_xlfn.CONCAT(Table1[[#This Row],[Reason not contacted]],Table1[[#This Row],[Reason not eligible]],Table1[[#This Row],[Reason not interested]],Table1[[#This Row],[Reason not enrolled]],Table1[[#This Row],[Reason first service not received]])","v":"Impact on provider relationship"}]
[1007,null,"45 to 64 yrs","M","Non-Hispanic/Latino","White","Yes","Yes","No","Self-employed","13+ weeks","Cardio or Respiratory","Non-work related","Non-workers comp","Industry 2","Occupation 1","Health provider","Clinic appointment schedules","County B","Phone",1,0,"No contact info",0,null,0,null,0,null,0,null,"2019-07-29",null,null,null,null,{"$f":"IF(Table1[[#This Row],[First service received]]=1,\"Never dropped\",IF(Table1[[#This Row],[Enrolled]]=1,\"No first service\",IF(Table1[[#This Row],[Expressed interest]]=1,\"Not enrolled\",IF(Table1[[#This Row],[Eligible]]=1,\"Not interested\",IF(Table1[[#This Row],[Contacted]]=1,\"Not eligible\",IF(Table1[[#This Row],[Identified]]=1,\"Not contacted\",\"\"))))))","v":"Not contacted"},{"$f":"_xlfn.CONCAT(Table1[[#This Row],[Reason not contacted]],Table1[[#This Row],[Reason not eligible]],Table1[[#This Row],[Reason not interested]],Table1[[#This Row],[Reason not enrolled]],Table1[[#This Row],[Reason first service not received]])","v":"No contact info"}]
[1034,null,"45 to 64 yrs","M","Non-Hispanic/Latino","White","Yes","Yes","No","Employed","2 to 6","Other","Non-work related","Non-workers comp","Industry 4","Occupation 4","Health provider","Clinic appointment schedules","County A","Phone",1,1,null,0,"Ineligible reason1",0,null,0,null,0,null,"2019-07-29","2019-08-13","2019-09-24",null,null,{"$f":"IF(Table1[[#This Row],[First service received]]=1,\"Never dropped\",IF(Table1[[#This Row],[Enrolled]]=1,\"No first service\",IF(Table1[[#This Row],[Expressed interest]]=1,\"Not enrolled\",IF(Table1[[#This Row],[Eligible]]=1,\"Not interested\",IF(Table1[[#This Row],[Contacted]]=1,\"Not eligible\",IF(Table1[[#This Row],[Identified]]=1,\"Not contacted\",\"\"))))))","v":"Not eligible"},{"$f":"_xlfn.CONCAT(Table1[[#This Row],[Reason not contacted]],Table1[[#This Row],[Reason not eligible]],Table1[[#This Row],[Reason not interested]],Table1[[#This Row],[Reason not enrolled]],Table1[[#This Row],[Reason first service not received]])","v":"Ineligible reason1"}]
[1076,null,"25 to 44 yrs","M","Non-Hispanic/Latino","White","Yes","No","No","Employed","7 to 12","MSK","Non-work related","Non-workers comp","Industry 3","Occupation 2","Health provider","Clinic appointment schedules","County A","Phone",1,1,null,1,null,1,null,1,null,1,null,"2019-07-29","2019-08-11","2019-08-25","2019-09-10","2019-09-19",{"$f":"IF(Table1[[#This Row],[First service received]]=1,\"Never dropped\",IF(Table1[[#This Row],[Enrolled]]=1,\"No first service\",IF(Table1[[#This Row],[Expressed interest]]=1,\"Not enrolled\",IF(Table1[[#This Row],[Eligible]]=1,\"Not interested\",IF(Table1[[#This Row],[Contacted]]=1,\"Not eligible\",IF(Table1[[#This Row],[Identified]]=1,\"Not contacted\",\"\"))))))","v":"Never dropped"},{"$f":"_xlfn.CONCAT(Table1[[#This Row],[Reason not contacted]],Table1[[#This Row],[Reason not eligible]],Table1[[#This Row],[Reason not interested]],Table1[[#This Row],[Reason not enrolled]],Table1[[#This Row],[Reason first service not received]])","v":""}]
[1153,null,"25 to 44 yrs","M","Non-Hispanic/Latino","Black or African-American","Yes","Yes","No","Employed","7 to 12","MSK","Non-work related","Non-workers comp","Industry 1","Occupation 3","Workforce partner","Electronic Health Records","County A","Other",1,0,"No contact info",0,null,0,null,0,null,0,null,"2019-07-29",null,null,null,null,{"$f":"IF(Table1[[#This Row],[First service received]]=1,\"Never dropped\",IF(Table1[[#This Row],[Enrolled]]=1,\"No first service\",IF(Table1[[#This Row],[Expressed interest]]=1,\"Not enrolled\",IF(Table1[[#This Row],[Eligible]]=1,\"Not interested\",IF(Table1[[#This Row],[Contacted]]=1,\"Not eligible\",IF(Table1[[#This Row],[Identified]]=1,\"Not contacted\",\"\"))))))","v":"Not contacted"},{"$f":"_xlfn.CONCAT(Table1[[#This Row],[Reason not contacted]],Table1[[#This Row],[Reason not eligible]],Table1[[#This Row],[Reason not interested]],Table1[[#This Row],[Reason not enrolled]],Table1[[#This Row],[Reason first service not received]])","v":"No contact info"}]
[1419,null,"25 to 44 yrs","M","Non-Hispanic/Latino","White","Yes","Yes","No","Employed","2 to 6","Other","Work related","Non-workers comp","Industry 3","Occupation 4","Workforce partner","Electronic Health Records","County B","Phone",1,1,null,1,null,0,"Impact on provider relationship",0,null,0,null,"2019-07-29","2019-08-11","2019-08-25",null,null,{"$f":"IF(Table1[[#This Row],[First service received]]=1,\"Never dropped\",IF(Table1[[#This Row],[Enrolled]]=1,\"No first service\",IF(Table1[[#This Row],[Expressed interest]]=1,\"Not enrolled\",IF(Table1[[#This Row],[Eligible]]=1,\"Not interested\",IF(Table1[[#This Row],[Contacted]]=1,\"Not eligible\",IF(Table1[[#This Row],[Identified]]=1,\"Not contacted\",\"\"))))))","v":"Not interested"},{"$f":"_xlfn.CONCAT(Table1[[#This Row],[Reason not contacted]],Table1[[#This Row],[Reason not eligible]],Table1[[#This Row],[Reason not interested]],Table1[[#This Row],[Reason not enrolled]],Table1[[#This Row],[Reason first service not received]])","v":"Impact on provider relationship"}]
[1509,null,"25 to 44 yrs","F","Non-Hispanic/Latino","White","Yes","Yes","No","Employed","7 to 12","MSK","Work related","Non-workers comp","Industry 1","Occupation 1","Health provider","Voc rehab centers","County B","Phone",1,1,null,1,null,0,"Don't want to be in research study",0,null,0,null,"2019-07-29","2019-08-07","2019-09-06",null,null,{"$f":"IF(Table1[[#This Row],[First service received]]=1,\"Never dropped\",IF(Table1[[#This Row],[Enrolled]]=1,\"No first service\",IF(Table1[[#This Row],[Expressed interest]]=1,\"Not enrolled\",IF(Table1[[#This Row],[Eligible]]=1,\"Not interested\",IF(Table1[[#This Row],[Contacted]]=1,\"Not eligible\",IF(Table1[[#This Row],[Identified]]=1,\"Not contacted\",\"\"))))))","v":"Not interested"},{"$f":"_xlfn.CONCAT(Table1[[#This Row],[Reason not contacted]],Table1[[#This Row],[Reason not eligible]],Table1[[#This Row],[Reason not interested]],Table1[[#This Row],[Reason not enrolled]],Table1[[#This Row],[Reason first service not received]])","v":"Don't want to be in research study"}]
[1035,null,"45 to 64 yrs","F","Non-Hispanic/Latino","White","No","Yes","No","Employed","2 to 6","MSK","Non-work related","Non-workers comp","Industry 1","Occupation 1","Health provider","Clinic appointment schedules","County B","In person",1,0,"No contact info",0,null,0,null,0,null,0,null,"2019-07-30",null,null,null,null,{"$f":"IF(Table1[[#This Row],[First service received]]=1,\"Never dropped\",IF(Table1[[#This Row],[Enrolled]]=1,\"No first service\",IF(Table1[[#This Row],[Expressed interest]]=1,\"Not enrolled\",IF(Table1[[#This Row],[Eligible]]=1,\"Not interested\",IF(Table1[[#This Row],[Contacted]]=1,\"Not eligible\",IF(Table1[[#This Row],[Identified]]=1,\"Not contacted\",\"\"))))))","v":"Not contacted"},{"$f":"_xlfn.CONCAT(Table1[[#This Row],[Reason not contacted]],Table1[[#This Row],[Reason not eligible]],Table1[[#This Row],[Reason not interested]],Table1[[#This Row],[Reason not enrolled]],Table1[[#This Row],[Reason first service not received]])","v":"No contact info"}]
[1217,null,"45 to 64 yrs","F","Non-Hispanic/Latino","White","Yes","Yes","No","Employed","2 to 6","MSK","Non-work related","Non-workers comp","Industry 3","Occupation 2","Employer","Electronic Health Records","County A","In person",1,1,null,1,null,1,null,1,null,1,null,"2019-07-30","2019-08-09","2019-08-12","2019-08-24","2019-09-07",{"$f":"IF(Table1[[#This Row],[First service received]]=1,\"Never dropped\",IF(Table1[[#This Row],[Enrolled]]=1,\"No first service\",IF(Table1[[#This Row],[Expressed interest]]=1,\"Not enrolled\",IF(Table1[[#This Row],[Eligible]]=1,\"Not interested\",IF(Table1[[#This Row],[Contacted]]=1,\"Not eligible\",IF(Table1[[#This Row],[Identified]]=1,\"Not contacted\",\"\"))))))","v":"Never dropped"},{"$f":"_xlfn.CONCAT(Table1[[#This Row],[Reason not contacted]],Table1[[#This Row],[Reason not eligible]],Table1[[#This Row],[Reason not interested]],Table1[[#This Row],[Reason not enrolled]],Table1[[#This Row],[Reason first service not received]])","v":""}]
[1252,null,"25 to 44 yrs","F","Non-Hispanic/Latino","White","No","Yes","No","Employed","13+ weeks","MSK","Non-work related","Non-workers comp","Industry 3","Occupation 3","Health provider","Clinic appointment schedules","County B","In person",1,1,null,1,null,0,"Not interested reason3",0,null,0,null,"2019-07-30","2019-08-08","2019-08-11",null,null,{"$f":"IF(Table1[[#This Row],[First service received]]=1,\"Never dropped\",IF(Table1[[#This Row],[Enrolled]]=1,\"No first service\",IF(Table1[[#This Row],[Expressed interest]]=1,\"Not enrolled\",IF(Table1[[#This Row],[Eligible]]=1,\"Not interested\",IF(Table1[[#This Row],[Contacted]]=1,\"Not eligible\",IF(Table1[[#This Row],[Identified]]=1,\"Not contacted\",\"\"))))))","v":"Not interested"},{"$f":"_xlfn.CONCAT(Table1[[#This Row],[Reason not contacted]],Table1[[#This Row],[Reason not eligible]],Table1[[#This Row],[Reason not interested]],Table1[[#This Row],[Reason not enrolled]],Table1[[#This Row],[Reason first service not received]])","v":"Not interested reason3"}]
[1277,null,"25 to 44 yrs","M","Non-Hispanic/Latino","White","No","Yes","No","Employed","0 to 1","Other","Non-work related","Non-workers comp","Industry 3","Occupation 3","Employer","Electronic Health Records","County B","Phone",1,1,null,1,null,0,"Impact on provider relationship",0,null,0,null,"2019-07-30","2019-08-13","2019-08-29",null,null,{"$f":"IF(Table1[[#This Row],[First service received]]=1,\"Never dropped\",IF(Table1[[#This Row],[Enrolled]]=1,\"No first service\",IF(Table1[[#This Row],[Expressed interest]]=1,\"Not enrolled\",IF(Table1[[#This Row],[Eligible]]=1,\"Not interested\",IF(Table1[[#This Row],[Contacted]]=1,\"Not eligible\",IF(Table1[[#This Row],[Identified]]=1,\"Not contacted\",\"\"))))))","v":"Not interested"},{"$f":"_xlfn.CONCAT(Table1[[#This Row],[Reason not contacted]],Table1[[#This Row],[Reason not eligible]],Table1[[#This Row],[Reason not interested]],Table1[[#This Row],[Reason not enrolled]],Table1[[#This Row],[Reason first service not received]])","v":"Impact on provider relationship"}]
[1001,"lorem ipsum","25 to 44 yrs","M","Non-Hispanic/Latino","White","Yes","Yes","No","Not Employed","0 to 1","Other","Work related","Workers comp","Industry 2","Occupation 1","Health provider","Worker’s comp database","County B","Phone",1,1,null,1,null,0,"Don't want to be in research study",0,null,0,null,"2019-07-31","2019-08-15","2019-08-16",null,null,{"$f":"IF(Table1[[#This Row],[First service received]]=1,\"Never dropped\",IF(Table1[[#This Row],[Enrolled]]=1,\"No first service\",IF(Table1[[#This Row],[Expressed interest]]=1,\"Not enrolled\",IF(Table1[[#This Row],[Eligible]]=1,\"Not interested\",IF(Table1[[#This Row],[Contacted]]=1,\"Not eligible\",IF(Table1[[#This Row],[Identified]]=1,\"Not contacted\",\"\"))))))","v":"Not interested"},{"$f":"_xlfn.CONCAT(Table1[[#This Row],[Reason not contacted]],Table1[[#This Row],[Reason not eligible]],Table1[[#This Row],[Reason not interested]],Table1[[#This Row],[Reason not enrolled]],Table1[[#This Row],[Reason first service not received]])","v":"Don't want to be in research study"}]
[1047,null,"25 to 44 yrs","F","Hispanic/Latino","White","Yes","Yes","No","Employed","7 to 12","Other","Non-work related","Non-workers comp","Industry 2","Occupation 1","Health provider","Worker’s comp database","County B","In person",1,1,null,1,null,1,null,0,"Circumstances changed",0,null,"2019-07-31","2019-08-11","2019-08-16",null,null,{"$f":"IF(Table1[[#This Row],[First service received]]=1,\"Never dropped\",IF(Table1[[#This Row],[Enrolled]]=1,\"No first service\",IF(Table1[[#This Row],[Expressed interest]]=1,\"Not enrolled\",IF(Table1[[#This Row],[Eligible]]=1,\"Not interested\",IF(Table1[[#This Row],[Contacted]]=1,\"Not eligible\",IF(Table1[[#This Row],[Identified]]=1,\"Not contacted\",\"\"))))))","v":"Not enrolled"},{"$f":"_xlfn.CONCAT(Table1[[#This Row],[Reason not contacted]],Table1[[#This Row],[Reason not eligible]],Table1[[#This Row],[Reason not interested]],Table1[[#This Row],[Reason not enrolled]],Table1[[#This Row],[Reason first service not received]])","v":"Circumstances changed"}]
[1188,null,"25 to 44 yrs","F","Non-Hispanic/Latino","Black or African-American","Yes","No","No","Employed","13+ weeks","MSK","Non-work related","Non-workers comp","Industry 3","Occupation 2","Employer","Electronic Health Records","County A","Phone",1,1,null,1,null,1,null,1,null,1,null,"2019-07-31","2019-08-11","2019-08-14","2019-09-01","2019-09-02",{"$f":"IF(Table1[[#This Row],[First service received]]=1,\"Never dropped\",IF(Table1[[#This Row],[Enrolled]]=1,\"No first service\",IF(Table1[[#This Row],[Expressed interest]]=1,\"Not enrolled\",IF(Table1[[#This Row],[Eligible]]=1,\"Not interested\",IF(Table1[[#This Row],[Contacted]]=1,\"Not eligible\",IF(Table1[[#This Row],[Identified]]=1,\"Not contacted\",\"\"))))))","v":"Never dropped"},{"$f":"_xlfn.CONCAT(Table1[[#This Row],[Reason not contacted]],Table1[[#This Row],[Reason not eligible]],Table1[[#This Row],[Reason not interested]],Table1[[#This Row],[Reason not enrolled]],Table1[[#This Row],[Reason first service not received]])","v":""}]
[1403,null,"45 to 64 yrs","F","Non-Hispanic/Latino","White","Yes","Yes","No","Not Employed","0 to 1","MSK","Work related","Workers comp","Industry 1","Occupation 3","Workforce partner","Electronic Health Records","County B","Phone",1,1,null,1,null,0,"Impact on provider relationship",0,null,0,null,"2019-07-31","2019-08-15","2019-08-17",null,null,{"$f":"IF(Table1[[#This Row],[First service received]]=1,\"Never dropped\",IF(Table1[[#This Row],[Enrolled]]=1,\"No first service\",IF(Table1[[#This Row],[Expressed interest]]=1,\"Not enrolled\",IF(Table1[[#This Row],[Eligible]]=1,\"Not interested\",IF(Table1[[#This Row],[Contacted]]=1,\"Not eligible\",IF(Table1[[#This Row],[Identified]]=1,\"Not contacted\",\"\"))))))","v":"Not interested"},{"$f":"_xlfn.CONCAT(Table1[[#This Row],[Reason not contacted]],Table1[[#This Row],[Reason not eligible]],Table1[[#This Row],[Reason not interested]],Table1[[#This Row],[Reason not enrolled]],Table1[[#This Row],[Reason first service not received]])","v":"Impact on provider relationship"}]
[1198,null,"25 to 44 yrs","F","Non-Hispanic/Latino","Other or 2 or more","Yes","Yes","No","Not Employed","0 to 1","MSK","Non-work related","Non-workers comp","Industry 4","Occupation 3","Health provider","Clinic appointment schedules","County B","Phone",1,1,null,1,null,0,"Impact on provider relationship",0,null,0,null,"2019-08-01","2019-08-06","2019-08-09",null,null,{"$f":"IF(Table1[[#This Row],[First service received]]=1,\"Never dropped\",IF(Table1[[#This Row],[Enrolled]]=1,\"No first service\",IF(Table1[[#This Row],[Expressed interest]]=1,\"Not enrolled\",IF(Table1[[#This Row],[Eligible]]=1,\"Not interested\",IF(Table1[[#This Row],[Contacted]]=1,\"Not eligible\",IF(Table1[[#This Row],[Identified]]=1,\"Not contacted\",\"\"))))))","v":"Not interested"},{"$f":"_xlfn.CONCAT(Table1[[#This Row],[Reason not contacted]],Table1[[#This Row],[Reason not eligible]],Table1[[#This Row],[Reason not interested]],Table1[[#This Row],[Reason not enrolled]],Table1[[#This Row],[Reason first service not received]])","v":"Impact on provider relationship"}]
[1259,null,"45 to 64 yrs","M","Non-Hispanic/Latino","White","Yes","Yes","No","Self-employed","13+ weeks","MSK","Non-work related","Non-workers comp","Industry 4","Occupation 3","Health provider","Worker’s comp database","County B","In person",1,1,null,1,null,1,null,1,null,1,null,"2019-08-01","2019-08-08","2019-08-14","2019-08-26","2019-08-27",{"$f":"IF(Table1[[#This Row],[First service received]]=1,\"Never dropped\",IF(Table1[[#This Row],[Enrolled]]=1,\"No first service\",IF(Table1[[#This Row],[Expressed interest]]=1,\"Not enrolled\",IF(Table1[[#This Row],[Eligible]]=1,\"Not interested\",IF(Table1[[#This Row],[Contacted]]=1,\"Not eligible\",IF(Table1[[#This Row],[Identified]]=1,\"Not contacted\",\"\"))))))","v":"Never dropped"},{"$f":"_xlfn.CONCAT(Table1[[#This Row],[Reason not contacted]],Table1[[#This Row],[Reason not eligible]],Table1[[#This Row],[Reason not interested]],Table1[[#This Row],[Reason not enrolled]],Table1[[#This Row],[Reason first service not received]])","v":""}]
[1364,null,"25 to 44 yrs","F","Non-Hispanic/Latino","White","Yes","Yes","No","Employed","2 to 6","MSK","Non-work related","Non-workers comp","Industry 3","Occupation 2","Health provider","FMLA forms","County B","Phone",1,1,null,1,null,1,null,1,null,1,null,"2019-08-01","2019-08-12","2019-08-20","2019-09-07","2019-09-20",{"$f":"IF(Table1[[#This Row],[First service received]]=1,\"Never dropped\",IF(Table1[[#This Row],[Enrolled]]=1,\"No first service\",IF(Table1[[#This Row],[Expressed interest]]=1,\"Not enrolled\",IF(Table1[[#This Row],[Eligible]]=1,\"Not interested\",IF(Table1[[#This Row],[Contacted]]=1,\"Not eligible\",IF(Table1[[#This Row],[Identified]]=1,\"Not contacted\",\"\"))))))","v":"Never dropped"},{"$f":"_xlfn.CONCAT(Table1[[#This Row],[Reason not contacted]],Table1[[#This Row],[Reason not eligible]],Table1[[#This Row],[Reason not interested]],Table1[[#This Row],[Reason not enrolled]],Table1[[#This Row],[Reason first service not received]])","v":""}]
[1380,null,"45 to 64 yrs","M","Non-Hispanic/Latino","Black or African-American","Yes","Yes","No","Employed","7 to 12","MSK","Work related","Workers comp","Industry 4","Occupation 3","Health provider","FMLA forms","County B","In person",1,1,null,0,"Ineligible reason1",0,null,0,null,0,null,"2019-08-01","2019-08-02","2019-08-12",null,null,{"$f":"IF(Table1[[#This Row],[First service received]]=1,\"Never dropped\",IF(Table1[[#This Row],[Enrolled]]=1,\"No first service\",IF(Table1[[#This Row],[Expressed interest]]=1,\"Not enrolled\",IF(Table1[[#This Row],[Eligible]]=1,\"Not interested\",IF(Table1[[#This Row],[Contacted]]=1,\"Not eligible\",IF(Table1[[#This Row],[Identified]]=1,\"Not contacted\",\"\"))))))","v":"Not eligible"},{"$f":"_xlfn.CONCAT(Table1[[#This Row],[Reason not contacted]],Table1[[#This Row],[Reason not eligible]],Table1[[#This Row],[Reason not interested]],Table1[[#This Row],[Reason not enrolled]],Table1[[#This Row],[Reason first service not received]])","v":"Ineligible reason1"}]
[1132,null,"45 to 64 yrs","F","Non-Hispanic/Latino","White","Yes","Yes","No","Not Employed","0 to 1","MSK","Non-work related","Non-workers comp","Industry 3","Occupation 2","Health provider","Worker’s comp database","County B","Phone",1,1,null,1,null,1,null,1,null,1,null,"2019-08-02","2019-08-08","2019-08-09","2019-09-03","2019-09-16",{"$f":"IF(Table1[[#This Row],[First service received]]=1,\"Never dropped\",IF(Table1[[#This Row],[Enrolled]]=1,\"No first service\",IF(Table1[[#This Row],[Expressed interest]]=1,\"Not enrolled\",IF(Table1[[#This Row],[Eligible]]=1,\"Not interested\",IF(Table1[[#This Row],[Contacted]]=1,\"Not eligible\",IF(Table1[[#This Row],[Identified]]=1,\"Not contacted\",\"\"))))))","v":"Never dropped"},{"$f":"_xlfn.CONCAT(Table1[[#This Row],[Reason not contacted]],Table1[[#This Row],[Reason not eligible]],Table1[[#This Row],[Reason not interested]],Table1[[#This Row],[Reason not enrolled]],Table1[[#This Row],[Reason first service not received]])","v":""}]
[1251,null,"45 to 64 yrs","M","Non-Hispanic/Latino","White","Yes","Yes","No","Self-employed","13+ weeks","Cardio or Respiratory","Non-work related","Non-workers comp","Industry 1","Occupation 3","Self","Electronic Health Records","County B","In person",1,1,null,0,"Ineligible reason1",0,null,0,null,0,null,"2019-08-02","2019-08-10","2019-08-10",null,null,{"$f":"IF(Table1[[#This Row],[First service received]]=1,\"Never dropped\",IF(Table1[[#This Row],[Enrolled]]=1,\"No first service\",IF(Table1[[#This Row],[Expressed interest]]=1,\"Not enrolled\",IF(Table1[[#This Row],[Eligible]]=1,\"Not interested\",IF(Table1[[#This Row],[Contacted]]=1,\"Not eligible\",IF(Table1[[#This Row],[Identified]]=1,\"Not contacted\",\"\"))))))","v":"Not eligible"},{"$f":"_xlfn.CONCAT(Table1[[#This Row],[Reason not contacted]],Table1[[#This Row],[Reason not eligible]],Table1[[#This Row],[Reason not interested]],Table1[[#This Row],[Reason not enrolled]],Table1[[#This Row],[Reason first service not received]])","v":"Ineligible reason1"}]
[1257,null,"45 to 64 yrs","F","Non-Hispanic/Latino","Black or African-American","No","Yes","No","Employed","7 to 12","Other","Non-work related","Non-workers comp","Industry 4","Occupation 3","Health provider","Work restriction forms","County B","Email",1,1,null,0,"Ineligible reason2",0,null,0,null,0,null,"2019-08-02","2019-08-11","2019-09-22",null,null,{"$f":"IF(Table1[[#This Row],[First service received]]=1,\"Never dropped\",IF(Table1[[#This Row],[Enrolled]]=1,\"No first service\",IF(Table1[[#This Row],[Expressed interest]]=1,\"Not enrolled\",IF(Table1[[#This Row],[Eligible]]=1,\"Not interested\",IF(Table1[[#This Row],[Contacted]]=1,\"Not eligible\",IF(Table1[[#This Row],[Identified]]=1,\"Not contacted\",\"\"))))))","v":"Not eligible"},{"$f":"_xlfn.CONCAT(Table1[[#This Row],[Reason not contacted]],Table1[[#This Row],[Reason not eligible]],Table1[[#This Row],[Reason not interested]],Table1[[#This Row],[Reason not enrolled]],Table1[[#This Row],[Reason first service not received]])","v":"Ineligible reason2"}]
[1345,null,"25 to 44 yrs","F","Non-Hispanic/Latino","American Indian or Alaska Native","Yes","Yes","No","Employed","0 to 1","Cardio or Respiratory","Non-work related","Non-workers comp","Industry 3","Occupation 4","Health provider","Worker’s comp database","County B","In person",1,0,"Contacted, no response",0,null,0,null,0,null,0,null,"2019-08-02",null,null,null,null,{"$f":"IF(Table1[[#This Row],[First service received]]=1,\"Never dropped\",IF(Table1[[#This Row],[Enrolled]]=1,\"No first service\",IF(Table1[[#This Row],[Expressed interest]]=1,\"Not enrolled\",IF(Table1[[#This Row],[Eligible]]=1,\"Not interested\",IF(Table1[[#This Row],[Contacted]]=1,\"Not eligible\",IF(Table1[[#This Row],[Identified]]=1,\"Not contacted\",\"\"))))))","v":"Not contacted"},{"$f":"_xlfn.CONCAT(Table1[[#This Row],[Reason not contacted]],Table1[[#This Row],[Reason not eligible]],Table1[[#This Row],[Reason not interested]],Table1[[#This Row],[Reason not enrolled]],Table1[[#This Row],[Reason first service not received]])","v":"Contacted, no response"}]
[1495,null,"25 to 44 yrs","F","Non-Hispanic/Latino","American Indian or Alaska Native","Yes","Yes","No","Employed","7 to 12","MSK","Work related","Non-workers comp","Industry 1","Occupation 3","Health provider","FMLA forms","County B","Phone",1,1,null,1,null,1,null,1,null,1,null,"2019-08-02","2019-08-10","2019-08-14","2019-08-24","2019-08-30",{"$f":"IF(Table1[[#This Row],[First service received]]=1,\"Never dropped\",IF(Table1[[#This Row],[Enrolled]]=1,\"No first service\",IF(Table1[[#This Row],[Expressed interest]]=1,\"Not enrolled\",IF(Table1[[#This Row],[Eligible]]=1,\"Not interested\",IF(Table1[[#This Row],[Contacted]]=1,\"Not eligible\",IF(Table1[[#This Row],[Identified]]=1,\"Not contacted\",\"\"))))))","v":"Never dropped"},{"$f":"_xlfn.CONCAT(Table1[[#This Row],[Reason not contacted]],Table1[[#This Row],[Reason not eligible]],Table1[[#This Row],[Reason not interested]],Table1[[#This Row],[Reason not enrolled]],Table1[[#This Row],[Reason first service not received]])","v":""}]
[1526,null,"25 to 44 yrs","F","Non-Hispanic/Latino","American Indian or Alaska Native","No","Yes","No","Not Employed","0 to 1","MSK","Non-work related","Non-workers comp","Industry 1","Occupation 1","Health provider","Work restriction forms","County B","Email",1,1,null,1,null,1,null,0,"Circumstances changed",0,null,"2019-08-02","2019-08-04","2019-09-04",null,null,{"$f":"IF(Table1[[#This Row],[First service received]]=1,\"Never dropped\",IF(Table1[[#This Row],[Enrolled]]=1,\"No first service\",IF(Table1[[#This Row],[Expressed interest]]=1,\"Not enrolled\",IF(Table1[[#This Row],[Eligible]]=1,\"Not interested\",IF(Table1[[#This Row],[Contacted]]=1,\"Not eligible\",IF(Table1[[#This Row],[Identified]]=1,\"Not contacted\",\"\"))))))","v":"Not enrolled"},{"$f":"_xlfn.CONCAT(Table1[[#This Row],[Reason not contacted]],Table1[[#This Row],[Reason not eligible]],Table1[[#This Row],[Reason not interested]],Table1[[#This Row],[Reason not enrolled]],Table1[[#This Row],[Reason first service not received]])","v":"Circumstances changed"}]
[1599,null,"25 to 44 yrs","M","Non-Hispanic/Latino","White","No","Yes","No","Employed","2 to 6","MSK","Work related","Workers comp","Industry 1","Occupation 3","Workforce partner","Electronic Health Records","County C","In person",1,1,null,1,null,0,"Not interested reason3",0,null,0,null,"2019-08-02","2019-08-07","2019-08-14",null,null,{"$f":"IF(Table1[[#This Row],[First service received]]=1,\"Never dropped\",IF(Table1[[#This Row],[Enrolled]]=1,\"No first service\",IF(Table1[[#This Row],[Expressed interest]]=1,\"Not enrolled\",IF(Table1[[#This Row],[Eligible]]=1,\"Not interested\",IF(Table1[[#This Row],[Contacted]]=1,\"Not eligible\",IF(Table1[[#This Row],[Identified]]=1,\"Not contacted\",\"\"))))))","v":"Not interested"},{"$f":"_xlfn.CONCAT(Table1[[#This Row],[Reason not contacted]],Table1[[#This Row],[Reason not eligible]],Table1[[#This Row],[Reason not interested]],Table1[[#This Row],[Reason not enrolled]],Table1[[#This Row],[Reason first service not received]])","v":"Not interested reason3"}]
[1615,null,"45 to 64 yrs","F","Non-Hispanic/Latino","Black or African-American","Yes","Yes","No","Employed","7 to 12","MSK","Non-work related","Non-workers comp","Industry 3","Occupation 2","Self","Electronic Health Records","County B","Phone",1,1,null,1,null,1,null,0,"Circumstances changed",0,null,"2019-08-02","2019-08-14","2019-09-13",null,null,{"$f":"IF(Table1[[#This Row],[First service received]]=1,\"Never dropped\",IF(Table1[[#This Row],[Enrolled]]=1,\"No first service\",IF(Table1[[#This Row],[Expressed interest]]=1,\"Not enrolled\",IF(Table1[[#This Row],[Eligible]]=1,\"Not interested\",IF(Table1[[#This Row],[Contacted]]=1,\"Not eligible\",IF(Table1[[#This Row],[Identified]]=1,\"Not contacted\",\"\"))))))","v":"Not enrolled"},{"$f":"_xlfn.CONCAT(Table1[[#This Row],[Reason not contacted]],Table1[[#This Row],[Reason not eligible]],Table1[[#This Row],[Reason not interested]],Table1[[#This Row],[Reason not enrolled]],Table1[[#This Row],[Reason first service not received]])","v":"Circumstances changed"}]
[1072,null,"25 to 44 yrs","M","Hispanic/Latino","White","Yes","Yes","No","Employed","2 to 6","MSK","Work related","Non-workers comp","Industry 3","Occupation 2","Health provider","Worker’s comp database","County B","Phone",1,1,null,1,null,1,null,1,null,1,null,"2019-08-03","2019-08-18","2019-08-23","2019-09-07","2019-09-20",{"$f":"IF(Table1[[#This Row],[First service received]]=1,\"Never dropped\",IF(Table1[[#This Row],[Enrolled]]=1,\"No first service\",IF(Table1[[#This Row],[Expressed interest]]=1,\"Not enrolled\",IF(Table1[[#This Row],[Eligible]]=1,\"Not interested\",IF(Table1[[#This Row],[Contacted]]=1,\"Not eligible\",IF(Table1[[#This Row],[Identified]]=1,\"Not contacted\",\"\"))))))","v":"Never dropped"},{"$f":"_xlfn.CONCAT(Table1[[#This Row],[Reason not contacted]],Table1[[#This Row],[Reason not eligible]],Table1[[#This Row],[Reason not interested]],Table1[[#This Row],[Reason not enrolled]],Table1[[#This Row],[Reason first service not received]])","v":""}]
[1288,null,"25 to 44 yrs","M","Hispanic/Latino","White","Yes","Yes","No","Employed","2 to 6","MSK","Work related","Non-workers comp","Industry 3","Occupation 2","Health provider","Worker’s comp database","County B","Email",1,1,null,1,null,1,null,1,null,1,null,"2019-08-03","2019-08-14","2019-08-27","2019-09-03","2019-09-06",{"$f":"IF(Table1[[#This Row],[First service received]]=1,\"Never dropped\",IF(Table1[[#This Row],[Enrolled]]=1,\"No first service\",IF(Table1[[#This Row],[Expressed interest]]=1,\"Not enrolled\",IF(Table1[[#This Row],[Eligible]]=1,\"Not interested\",IF(Table1[[#This Row],[Contacted]]=1,\"Not eligible\",IF(Table1[[#This Row],[Identified]]=1,\"Not contacted\",\"\"))))))","v":"Never dropped"},{"$f":"_xlfn.CONCAT(Table1[[#This Row],[Reason not contacted]],Table1[[#This Row],[Reason not eligible]],Table1[[#This Row],[Reason not interested]],Table1[[#This Row],[Reason not enrolled]],Table1[[#This Row],[Reason first service not received]])","v":""}]
[1408,null,"45 to 64 yrs","M","Non-Hispanic/Latino","Black or African-American","Yes","Yes","No","Employed","2 to 6","Other","Non-work related","Non-workers comp","Industry 3","Occupation 3","Health provider","Clinic appointment schedules","County A","Email",1,1,null,1,null,0,"Don't want to be in research study",0,null,0,null,"2019-08-03","2019-08-14","2019-08-20",null,null,{"$f":"IF(Table1[[#This Row],[First service received]]=1,\"Never dropped\",IF(Table1[[#This Row],[Enrolled]]=1,\"No first service\",IF(Table1[[#This Row],[Expressed interest]]=1,\"Not enrolled\",IF(Table1[[#This Row],[Eligible]]=1,\"Not interested\",IF(Table1[[#This Row],[Contacted]]=1,\"Not eligible\",IF(Table1[[#This Row],[Identified]]=1,\"Not contacted\",\"\"))))))","v":"Not interested"},{"$f":"_xlfn.CONCAT(Table1[[#This Row],[Reason not contacted]],Table1[[#This Row],[Reason not eligible]],Table1[[#This Row],[Reason not interested]],Table1[[#This Row],[Reason not enrolled]],Table1[[#This Row],[Reason first service not received]])","v":"Don't want to be in research study"}]
[1469,null,"25 to 44 yrs","F","Non-Hispanic/Latino","White","Yes","Yes","No","Employed","7 to 12","Other","Non-work related","Non-workers comp","Industry 3","Occupation 2","Health provider","FMLA forms","County B","Email",1,1,null,0,"Ineligible reason1",0,null,0,null,0,null,"2019-08-03","2019-08-09","2019-09-08",null,null,{"$f":"IF(Table1[[#This Row],[First service received]]=1,\"Never dropped\",IF(Table1[[#This Row],[Enrolled]]=1,\"No first service\",IF(Table1[[#This Row],[Expressed interest]]=1,\"Not enrolled\",IF(Table1[[#This Row],[Eligible]]=1,\"Not interested\",IF(Table1[[#This Row],[Contacted]]=1,\"Not eligible\",IF(Table1[[#This Row],[Identified]]=1,\"Not contacted\",\"\"))))))","v":"Not eligible"},{"$f":"_xlfn.CONCAT(Table1[[#This Row],[Reason not contacted]],Table1[[#This Row],[Reason not eligible]],Table1[[#This Row],[Reason not interested]],Table1[[#This Row],[Reason not enrolled]],Table1[[#This Row],[Reason first service not received]])","v":"Ineligible reason1"}]
[1517,null,"45 to 64 yrs","F","Hispanic/Latino","White","No","No","No","Employed","7 to 12","MSK","Non-work related","Non-workers comp","Industry 1","Occupation 3","Health provider","Worker’s comp database","County B","Phone",1,1,null,1,null,1,null,1,null,1,null,"2019-08-03","2019-08-17","2019-08-18","2019-09-02","2019-09-12",{"$f":"IF(Table1[[#This Row],[First service received]]=1,\"Never dropped\",IF(Table1[[#This Row],[Enrolled]]=1,\"No first service\",IF(Table1[[#This Row],[Expressed interest]]=1,\"Not enrolled\",IF(Table1[[#This Row],[Eligible]]=1,\"Not interested\",IF(Table1[[#This Row],[Contacted]]=1,\"Not eligible\",IF(Table1[[#This Row],[Identified]]=1,\"Not contacted\",\"\"))))))","v":"Never dropped"},{"$f":"_xlfn.CONCAT(Table1[[#This Row],[Reason not contacted]],Table1[[#This Row],[Reason not eligible]],Table1[[#This Row],[Reason not interested]],Table1[[#This Row],[Reason not enrolled]],Table1[[#This Row],[Reason first service not received]])","v":""}]
[1592,null,"45 to 64 yrs","F","Non-Hispanic/Latino","White","Yes","Yes","No","Employed","13+ weeks","Other","Non-work related","Non-workers comp","Industry 2","Occupation 4","Health provider","FMLA forms","County A","In person",1,1,null,1,null,1,null,0,"Not enrolled reason1",0,null,"2019-08-03","2019-08-17","2019-08-28",null,null,{"$f":"IF(Table1[[#This Row],[First service received]]=1,\"Never dropped\",IF(Table1[[#This Row],[Enrolled]]=1,\"No first service\",IF(Table1[[#This Row],[Expressed interest]]=1,\"Not enrolled\",IF(Table1[[#This Row],[Eligible]]=1,\"Not interested\",IF(Table1[[#This Row],[Contacted]]=1,\"Not eligible\",IF(Table1[[#This Row],[Identified]]=1,\"Not contacted\",\"\"))))))","v":"Not enrolled"},{"$f":"_xlfn.CONCAT(Table1[[#This Row],[Reason not contacted]],Table1[[#This Row],[Reason not eligible]],Table1[[#This Row],[Reason not interested]],Table1[[#This Row],[Reason not enrolled]],Table1[[#This Row],[Reason first service not received]])","v":"Not enrolled reason1"}]
[1151,null,"25 to 44 yrs","M","Hispanic/Latino","White","Yes","Yes","No","Employed","7 to 12","Other","Non-work related","Non-workers comp","Industry 3","Occupation 2","Workforce partner","Electronic Health Records","County B","Phone",1,1,null,1,null,0,"Don't want to be in research study",0,null,0,null,"2019-08-04","2019-08-13","2019-08-31",null,null,{"$f":"IF(Table1[[#This Row],[First service received]]=1,\"Never dropped\",IF(Table1[[#This Row],[Enrolled]]=1,\"No first service\",IF(Table1[[#This Row],[Expressed interest]]=1,\"Not enrolled\",IF(Table1[[#This Row],[Eligible]]=1,\"Not interested\",IF(Table1[[#This Row],[Contacted]]=1,\"Not eligible\",IF(Table1[[#This Row],[Identified]]=1,\"Not contacted\",\"\"))))))","v":"Not interested"},{"$f":"_xlfn.CONCAT(Table1[[#This Row],[Reason not contacted]],Table1[[#This Row],[Reason not eligible]],Table1[[#This Row],[Reason not interested]],Table1[[#This Row],[Reason not enrolled]],Table1[[#This Row],[Reason first service not received]])","v":"Don't want to be in research study"}]
[1229,null,"25 to 44 yrs","M","Non-Hispanic/Latino","White","Yes","Yes","No","Employed","0 to 1","Other","Work related","Non-workers comp","Industry 2","Occupation 4","Self","Electronic Health Records","County B","In person",1,0,"Contacted, no response",0,null,0,null,0,null,0,null,"2019-08-04",null,null,null,null,{"$f":"IF(Table1[[#This Row],[First service received]]=1,\"Never dropped\",IF(Table1[[#This Row],[Enrolled]]=1,\"No first service\",IF(Table1[[#This Row],[Expressed interest]]=1,\"Not enrolled\",IF(Table1[[#This Row],[Eligible]]=1,\"Not interested\",IF(Table1[[#This Row],[Contacted]]=1,\"Not eligible\",IF(Table1[[#This Row],[Identified]]=1,\"Not contacted\",\"\"))))))","v":"Not contacted"},{"$f":"_xlfn.CONCAT(Table1[[#This Row],[Reason not contacted]],Table1[[#This Row],[Reason not eligible]],Table1[[#This Row],[Reason not interested]],Table1[[#This Row],[Reason not enrolled]],Table1[[#This Row],[Reason first service not received]])","v":"Contacted, no response"}]
[1436,null,"25 to 44 yrs","M","Non-Hispanic/Latino","White","Yes","Yes","No","Employed","7 to 12","MSK","Work related","Non-workers comp","Industry 1","Occupation 4","Health provider","FMLA forms","County A","Email",1,1,null,1,null,1,null,1,null,1,null,"2019-08-04","2019-08-09","2019-08-17","2019-09-01","2019-09-04",{"$f":"IF(Table1[[#This Row],[First service received]]=1,\"Never dropped\",IF(Table1[[#This Row],[Enrolled]]=1,\"No first service\",IF(Table1[[#This Row],[Expressed interest]]=1,\"Not enrolled\",IF(Table1[[#This Row],[Eligible]]=1,\"Not interested\",IF(Table1[[#This Row],[Contacted]]=1,\"Not eligible\",IF(Table1[[#This Row],[Identified]]=1,\"Not contacted\",\"\"))))))","v":"Never dropped"},{"$f":"_xlfn.CONCAT(Table1[[#This Row],[Reason not contacted]],Table1[[#This Row],[Reason not eligible]],Table1[[#This Row],[Reason not interested]],Table1[[#This Row],[Reason not enrolled]],Table1[[#This Row],[Reason first service not received]])","v":""}]
[1523,null,"45 to 64 yrs","M","Non-Hispanic/Latino","White","No","Yes","No","Employed","2 to 6","MSK","Work related","Non-workers comp","Industry 1","Occupation 3","Employer","Electronic Health Records","County B","In person",1,1,null,1,null,1,null,1,null,1,null,"2019-08-04","2019-08-07","2019-08-21","2019-09-01","2019-09-09",{"$f":"IF(Table1[[#This Row],[First service received]]=1,\"Never dropped\",IF(Table1[[#This Row],[Enrolled]]=1,\"No first service\",IF(Table1[[#This Row],[Expressed interest]]=1,\"Not enrolled\",IF(Table1[[#This Row],[Eligible]]=1,\"Not interested\",IF(Table1[[#This Row],[Contacted]]=1,\"Not eligible\",IF(Table1[[#This Row],[Identified]]=1,\"Not contacted\",\"\"))))))","v":"Never dropped"},{"$f":"_xlfn.CONCAT(Table1[[#This Row],[Reason not contacted]],Table1[[#This Row],[Reason not eligible]],Table1[[#This Row],[Reason not interested]],Table1[[#This Row],[Reason not enrolled]],Table1[[#This Row],[Reason first service not received]])","v":""}]
[1073,null,"25 to 44 yrs","M","Hispanic/Latino","White","Yes","Yes","No","Employed","0 to 1","MSK","Non-work related","Non-workers comp","Industry 3","Occupation 2","Workforce partner","Electronic Health Records","County B","Phone",1,0,"Contacted, no response",0,null,0,null,0,null,0,null,"2019-08-05",null,null,null,null,{"$f":"IF(Table1[[#This Row],[First service received]]=1,\"Never dropped\",IF(Table1[[#This Row],[Enrolled]]=1,\"No first service\",IF(Table1[[#This Row],[Expressed interest]]=1,\"Not enrolled\",IF(Table1[[#This Row],[Eligible]]=1,\"Not interested\",IF(Table1[[#This Row],[Contacted]]=1,\"Not eligible\",IF(Table1[[#This Row],[Identified]]=1,\"Not contacted\",\"\"))))))","v":"Not contacted"},{"$f":"_xlfn.CONCAT(Table1[[#This Row],[Reason not contacted]],Table1[[#This Row],[Reason not eligible]],Table1[[#This Row],[Reason not interested]],Table1[[#This Row],[Reason not enrolled]],Table1[[#This Row],[Reason first service not received]])","v":"Contacted, no response"}]
[1101,null,"25 to 44 yrs","M","Non-Hispanic/Latino","Other or 2 or more","Yes","Yes","No","Employed","0 to 1","Other","Non-work related","Non-workers comp","Industry 1","Occupation 3","Health provider","Worker’s comp database","County B","In person",1,0,"Contacted, no response",0,null,0,null,0,null,0,null,"2019-08-05",null,null,null,null,{"$f":"IF(Table1[[#This Row],[First service received]]=1,\"Never dropped\",IF(Table1[[#This Row],[Enrolled]]=1,\"No first service\",IF(Table1[[#This Row],[Expressed interest]]=1,\"Not enrolled\",IF(Table1[[#This Row],[Eligible]]=1,\"Not interested\",IF(Table1[[#This Row],[Contacted]]=1,\"Not eligible\",IF(Table1[[#This Row],[Identified]]=1,\"Not contacted\",\"\"))))))","v":"Not contacted"},{"$f":"_xlfn.CONCAT(Table1[[#This Row],[Reason not contacted]],Table1[[#This Row],[Reason not eligible]],Table1[[#This Row],[Reason not interested]],Table1[[#This Row],[Reason not enrolled]],Table1[[#This Row],[Reason first service not received]])","v":"Contacted, no response"}]
[1120,null,"25 to 44 yrs","M","Non-Hispanic/Latino","White","No","Yes","No","Employed","7 to 12","MSK","Non-work related","Non-workers comp","Industry 4","Occupation 1","Self","Electronic Health Records","County B","In person",1,1,null,1,null,1,null,0,"Not enrolled reason1",0,null,"2019-08-05","2019-08-06","2019-09-10",null,null,{"$f":"IF(Table1[[#This Row],[First service received]]=1,\"Never dropped\",IF(Table1[[#This Row],[Enrolled]]=1,\"No first service\",IF(Table1[[#This Row],[Expressed interest]]=1,\"Not enrolled\",IF(Table1[[#This Row],[Eligible]]=1,\"Not interested\",IF(Table1[[#This Row],[Contacted]]=1,\"Not eligible\",IF(Table1[[#This Row],[Identified]]=1,\"Not contacted\",\"\"))))))","v":"Not enrolled"},{"$f":"_xlfn.CONCAT(Table1[[#This Row],[Reason not contacted]],Table1[[#This Row],[Reason not eligible]],Table1[[#This Row],[Reason not interested]],Table1[[#This Row],[Reason not enrolled]],Table1[[#This Row],[Reason first service not received]])","v":"Not enrolled reason1"}]
[1249,null,"45 to 64 yrs","F","Hispanic/Latino","White","Yes","Yes","No","Not Employed","0 to 1","Other","Non-work related","Non-workers comp","Industry 2","Occupation 3","Health provider","Work restriction forms","County B","Phone",1,1,null,1,null,0,"Don't want to be in research study",0,null,0,null,"2019-08-05","2019-08-06","2019-08-08",null,null,{"$f":"IF(Table1[[#This Row],[First service received]]=1,\"Never dropped\",IF(Table1[[#This Row],[Enrolled]]=1,\"No first service\",IF(Table1[[#This Row],[Expressed interest]]=1,\"Not enrolled\",IF(Table1[[#This Row],[Eligible]]=1,\"Not interested\",IF(Table1[[#This Row],[Contacted]]=1,\"Not eligible\",IF(Table1[[#This Row],[Identified]]=1,\"Not contacted\",\"\"))))))","v":"Not interested"},{"$f":"_xlfn.CONCAT(Table1[[#This Row],[Reason not contacted]],Table1[[#This Row],[Reason not eligible]],Table1[[#This Row],[Reason not interested]],Table1[[#This Row],[Reason not enrolled]],Table1[[#This Row],[Reason first service not received]])","v":"Don't want to be in research study"}]
[1450,null,"45 to 64 yrs","F","Non-Hispanic/Latino","White","Yes","Yes","No","Employed","2 to 6","MSK","Work related","Workers comp","Industry 2","Occupation 3","Health provider","Clinic appointment schedules","County B","In person",1,1,null,0,"Ineligible reason3",0,null,0,null,0,null,"2019-08-05","2019-08-17","2019-09-29",null,null,{"$f":"IF(Table1[[#This Row],[First service received]]=1,\"Never dropped\",IF(Table1[[#This Row],[Enrolled]]=1,\"No first service\",IF(Table1[[#This Row],[Expressed interest]]=1,\"Not enrolled\",IF(Table1[[#This Row],[Eligible]]=1,\"Not interested\",IF(Table1[[#This Row],[Contacted]]=1,\"Not eligible\",IF(Table1[[#This Row],[Identified]]=1,\"Not contacted\",\"\"))))))","v":"Not eligible"},{"$f":"_xlfn.CONCAT(Table1[[#This Row],[Reason not contacted]],Table1[[#This Row],[Reason not eligible]],Table1[[#This Row],[Reason not interested]],Table1[[#This Row],[Reason not enrolled]],Table1[[#This Row],[Reason first service not received]])","v":"Ineligible reason3"}]
[1507,null,"25 to 44 yrs","M","Non-Hispanic/Latino","White","Yes","Yes","No","Employed","7 to 12","Other","Work related","Non-workers comp","Industry 1","Occupation 1","Health provider","Voc rehab centers","County B","Phone",1,1,null,1,null,0,"Don't want to be in research study",0,null,0,null,"2019-08-05","2019-08-13","2019-08-14",null,null,{"$f":"IF(Table1[[#This Row],[First service received]]=1,\"Never dropped\",IF(Table1[[#This Row],[Enrolled]]=1,\"No first service\",IF(Table1[[#This Row],[Expressed interest]]=1,\"Not enrolled\",IF(Table1[[#This Row],[Eligible]]=1,\"Not interested\",IF(Table1[[#This Row],[Contacted]]=1,\"Not eligible\",IF(Table1[[#This Row],[Identified]]=1,\"Not contacted\",\"\"))))))","v":"Not interested"},{"$f":"_xlfn.CONCAT(Table1[[#This Row],[Reason not contacted]],Table1[[#This Row],[Reason not eligible]],Table1[[#This Row],[Reason not interested]],Table1[[#This Row],[Reason not enrolled]],Table1[[#This Row],[Reason first service not received]])","v":"Don't want to be in research study"}]
[1546,null,"25 to 44 yrs","M","Non-Hispanic/Latino","White","No","Yes","Yes","Not Employed","0 to 1","Other","Non-work related","Non-workers comp","Industry 1","Occupation 3","Workforce partner","Electronic Health Records","County B","Email",1,1,null,1,null,0,"Don't want to be in research study",0,null,0,null,"2019-08-06","2019-08-13","2019-09-26",null,null,{"$f":"IF(Table1[[#This Row],[First service received]]=1,\"Never dropped\",IF(Table1[[#This Row],[Enrolled]]=1,\"No first service\",IF(Table1[[#This Row],[Expressed interest]]=1,\"Not enrolled\",IF(Table1[[#This Row],[Eligible]]=1,\"Not interested\",IF(Table1[[#This Row],[Contacted]]=1,\"Not eligible\",IF(Table1[[#This Row],[Identified]]=1,\"Not contacted\",\"\"))))))","v":"Not interested"},{"$f":"_xlfn.CONCAT(Table1[[#This Row],[Reason not contacted]],Table1[[#This Row],[Reason not eligible]],Table1[[#This Row],[Reason not interested]],Table1[[#This Row],[Reason not enrolled]],Table1[[#This Row],[Reason first service not received]])","v":"Don't want to be in research study"}]
[1302,null,"25 to 44 yrs","F","Non-Hispanic/Latino","White","Yes","Yes","No","Employed","2 to 6","Cardio or Respiratory","Non-work related","Non-workers comp","Industry 3","Occupation 2","Workforce partner","Electronic Health Records","County B","In person",1,1,null,0,"Ineligible reason2",0,null,0,null,0,null,"2019-08-07","2019-08-15","2019-09-03",null,null,{"$f":"IF(Table1[[#This Row],[First service received]]=1,\"Never dropped\",IF(Table1[[#This Row],[Enrolled]]=1,\"No first service\",IF(Table1[[#This Row],[Expressed interest]]=1,\"Not enrolled\",IF(Table1[[#This Row],[Eligible]]=1,\"Not interested\",IF(Table1[[#This Row],[Contacted]]=1,\"Not eligible\",IF(Table1[[#This Row],[Identified]]=1,\"Not contacted\",\"\"))))))","v":"Not eligible"},{"$f":"_xlfn.CONCAT(Table1[[#This Row],[Reason not contacted]],Table1[[#This Row],[Reason not eligible]],Table1[[#This Row],[Reason not interested]],Table1[[#This Row],[Reason not enrolled]],Table1[[#This Row],[Reason first service not received]])","v":"Ineligible reason2"}]
[1350,null,"25 to 44 yrs","M","Hispanic/Latino","White","Yes","Yes","No","Employed","2 to 6","MSK","Non-work related","Non-workers comp","Industry 4","Occupation 3","Health provider","Worker’s comp database","County A","Email",1,1,null,1,null,0,"Impact on provider relationship",0,null,0,null,"2019-08-07","2019-08-17","2019-09-07",null,null,{"$f":"IF(Table1[[#This Row],[First service received]]=1,\"Never dropped\",IF(Table1[[#This Row],[Enrolled]]=1,\"No first service\",IF(Table1[[#This Row],[Expressed interest]]=1,\"Not enrolled\",IF(Table1[[#This Row],[Eligible]]=1,\"Not interested\",IF(Table1[[#This Row],[Contacted]]=1,\"Not eligible\",IF(Table1[[#This Row],[Identified]]=1,\"Not contacted\",\"\"))))))","v":"Not interested"},{"$f":"_xlfn.CONCAT(Table1[[#This Row],[Reason not contacted]],Table1[[#This Row],[Reason not eligible]],Table1[[#This Row],[Reason not interested]],Table1[[#This Row],[Reason not enrolled]],Table1[[#This Row],[Reason first service not received]])","v":"Impact on provider relationship"}]
[1468,null,"25 to 44 yrs","F","Non-Hispanic/Latino","White","Yes","Yes","No","Not Employed","0 to 1","MSK","Non-work related","Non-workers comp","Industry 2","Occupation 1","Health provider","Worker’s comp database","County B","Phone",1,1,null,0,"Ineligible reason1",0,null,0,null,0,null,"2019-08-07","2019-08-10","2019-08-15",null,null,{"$f":"IF(Table1[[#This Row],[First service received]]=1,\"Never dropped\",IF(Table1[[#This Row],[Enrolled]]=1,\"No first service\",IF(Table1[[#This Row],[Expressed interest]]=1,\"Not enrolled\",IF(Table1[[#This Row],[Eligible]]=1,\"Not interested\",IF(Table1[[#This Row],[Contacted]]=1,\"Not eligible\",IF(Table1[[#This Row],[Identified]]=1,\"Not contacted\",\"\"))))))","v":"Not eligible"},{"$f":"_xlfn.CONCAT(Table1[[#This Row],[Reason not contacted]],Table1[[#This Row],[Reason not eligible]],Table1[[#This Row],[Reason not interested]],Table1[[#This Row],[Reason not enrolled]],Table1[[#This Row],[Reason first service not received]])","v":"Ineligible reason1"}]
[1572,null,"25 to 44 yrs","M","Non-Hispanic/Latino","White","Yes","Yes","No","Employed","2 to 6","MSK","Work related","Non-workers comp","Industry 3","Occupation 2","Health provider","Clinic appointment schedules","County B","Email",1,0,"Contacted, no response",0,null,0,null,0,null,0,null,"2019-08-07",null,null,null,null,{"$f":"IF(Table1[[#This Row],[First service received]]=1,\"Never dropped\",IF(Table1[[#This Row],[Enrolled]]=1,\"No first service\",IF(Table1[[#This Row],[Expressed interest]]=1,\"Not enrolled\",IF(Table1[[#This Row],[Eligible]]=1,\"Not interested\",IF(Table1[[#This Row],[Contacted]]=1,\"Not eligible\",IF(Table1[[#This Row],[Identified]]=1,\"Not contacted\",\"\"))))))","v":"Not contacted"},{"$f":"_xlfn.CONCAT(Table1[[#This Row],[Reason not contacted]],Table1[[#This Row],[Reason not eligible]],Table1[[#This Row],[Reason not interested]],Table1[[#This Row],[Reason not enrolled]],Table1[[#This Row],[Reason first service not received]])","v":"Contacted, no response"}]
[1590,null,"45 to 64 yrs","F","Non-Hispanic/Latino","White","No","Yes","No","Employed","2 to 6","Other","Non-work related","Non-workers comp","Industry 1","Occupation 1","Health provider","Worker’s comp database","County A","In person",1,1,null,1,null,1,null,0,"Circumstances changed",0,null,"2019-08-07","2019-08-17","2019-09-13",null,null,{"$f":"IF(Table1[[#This Row],[First service received]]=1,\"Never dropped\",IF(Table1[[#This Row],[Enrolled]]=1,\"No first service\",IF(Table1[[#This Row],[Expressed interest]]=1,\"Not enrolled\",IF(Table1[[#This Row],[Eligible]]=1,\"Not interested\",IF(Table1[[#This Row],[Contacted]]=1,\"Not eligible\",IF(Table1[[#This Row],[Identified]]=1,\"Not contacted\",\"\"))))))","v":"Not enrolled"},{"$f":"_xlfn.CONCAT(Table1[[#This Row],[Reason not contacted]],Table1[[#This Row],[Reason not eligible]],Table1[[#This Row],[Reason not interested]],Table1[[#This Row],[Reason not enrolled]],Table1[[#This Row],[Reason first service not received]])","v":"Circumstances changed"}]
[1149,null,"45 to 64 yrs","F","Non-Hispanic/Latino","White","No","No","No","Employed","2 to 6","MSK","Work related","Workers comp","Industry 4","Occupation 3","Health provider","Voc rehab centers","County A","Email",1,1,null,1,null,1,null,1,null,1,null,"2019-08-08","2019-08-12","2019-08-25","2019-08-26","2019-08-29",{"$f":"IF(Table1[[#This Row],[First service received]]=1,\"Never dropped\",IF(Table1[[#This Row],[Enrolled]]=1,\"No first service\",IF(Table1[[#This Row],[Expressed interest]]=1,\"Not enrolled\",IF(Table1[[#This Row],[Eligible]]=1,\"Not interested\",IF(Table1[[#This Row],[Contacted]]=1,\"Not eligible\",IF(Table1[[#This Row],[Identified]]=1,\"Not contacted\",\"\"))))))","v":"Never dropped"},{"$f":"_xlfn.CONCAT(Table1[[#This Row],[Reason not contacted]],Table1[[#This Row],[Reason not eligible]],Table1[[#This Row],[Reason not interested]],Table1[[#This Row],[Reason not enrolled]],Table1[[#This Row],[Reason first service not received]])","v":""}]
[1354,null,"25 to 44 yrs","M","Non-Hispanic/Latino","White","No","Yes","No","Employed","0 to 1","MSK","Non-work related","Non-workers comp","Industry 3","Occupation 2","Health provider","Worker’s comp database","County B","In person",1,1,null,1,null,0,"Not interested reason3",0,null,0,null,"2019-08-08","2019-08-15","2019-09-06",null,null,{"$f":"IF(Table1[[#This Row],[First service received]]=1,\"Never dropped\",IF(Table1[[#This Row],[Enrolled]]=1,\"No first service\",IF(Table1[[#This Row],[Expressed interest]]=1,\"Not enrolled\",IF(Table1[[#This Row],[Eligible]]=1,\"Not interested\",IF(Table1[[#This Row],[Contacted]]=1,\"Not eligible\",IF(Table1[[#This Row],[Identified]]=1,\"Not contacted\",\"\"))))))","v":"Not interested"},{"$f":"_xlfn.CONCAT(Table1[[#This Row],[Reason not contacted]],Table1[[#This Row],[Reason not eligible]],Table1[[#This Row],[Reason not interested]],Table1[[#This Row],[Reason not enrolled]],Table1[[#This Row],[Reason first service not received]])","v":"Not interested reason3"}]
[1363,null,"45 to 64 yrs","M","Non-Hispanic/Latino","White","Yes","Yes","No","Not Employed","0 to 1","MSK","Non-work related","Non-workers comp","Industry 4","Occupation 3","Health provider","Voc rehab centers","County A","Phone",1,1,null,1,null,1,null,1,null,1,null,"2019-08-08","2019-08-22","2019-09-02","2019-09-13","2019-09-17",{"$f":"IF(Table1[[#This Row],[First service received]]=1,\"Never dropped\",IF(Table1[[#This Row],[Enrolled]]=1,\"No first service\",IF(Table1[[#This Row],[Expressed interest]]=1,\"Not enrolled\",IF(Table1[[#This Row],[Eligible]]=1,\"Not interested\",IF(Table1[[#This Row],[Contacted]]=1,\"Not eligible\",IF(Table1[[#This Row],[Identified]]=1,\"Not contacted\",\"\"))))))","v":"Never dropped"},{"$f":"_xlfn.CONCAT(Table1[[#This Row],[Reason not contacted]],Table1[[#This Row],[Reason not eligible]],Table1[[#This Row],[Reason not interested]],Table1[[#This Row],[Reason not enrolled]],Table1[[#This Row],[Reason first service not received]])","v":""}]
[1502,null,"18 to 24 yrs","F","Hispanic/Latino","White","No","Yes","No","Employed","0 to 1","MSK","Work related","Non-workers comp","Industry 1","Occupation 3","Health provider","Worker’s comp database","County B","Phone",1,0,"Contacted, no response",0,null,0,null,0,null,0,null,"2019-08-08",null,null,null,null,{"$f":"IF(Table1[[#This Row],[First service received]]=1,\"Never dropped\",IF(Table1[[#This Row],[Enrolled]]=1,\"No first service\",IF(Table1[[#This Row],[Expressed interest]]=1,\"Not enrolled\",IF(Table1[[#This Row],[Eligible]]=1,\"Not interested\",IF(Table1[[#This Row],[Contacted]]=1,\"Not eligible\",IF(Table1[[#This Row],[Identified]]=1,\"Not contacted\",\"\"))))))","v":"Not contacted"},{"$f":"_xlfn.CONCAT(Table1[[#This Row],[Reason not contacted]],Table1[[#This Row],[Reason not eligible]],Table1[[#This Row],[Reason not interested]],Table1[[#This Row],[Reason not enrolled]],Table1[[#This Row],[Reason first service not received]])","v":"Contacted, no response"}]
[1063,null,"45 to 64 yrs","F","Non-Hispanic/Latino","White","No","Yes","No","Not Employed","0 to 1","Other","Work related","Workers comp","Industry 1","Occupation 3","Health provider","Worker’s comp database","County C","Email",1,1,null,0,"Ineligible reason3",0,null,0,null,0,null,"2019-08-09","2019-08-13","2019-08-17",null,null,{"$f":"IF(Table1[[#This Row],[First service received]]=1,\"Never dropped\",IF(Table1[[#This Row],[Enrolled]]=1,\"No first service\",IF(Table1[[#This Row],[Expressed interest]]=1,\"Not enrolled\",IF(Table1[[#This Row],[Eligible]]=1,\"Not interested\",IF(Table1[[#This Row],[Contacted]]=1,\"Not eligible\",IF(Table1[[#This Row],[Identified]]=1,\"Not contacted\",\"\"))))))","v":"Not eligible"},{"$f":"_xlfn.CONCAT(Table1[[#This Row],[Reason not contacted]],Table1[[#This Row],[Reason not eligible]],Table1[[#This Row],[Reason not interested]],Table1[[#This Row],[Reason not enrolled]],Table1[[#This Row],[Reason first service not received]])","v":"Ineligible reason3"}]
[1176,null,"45 to 64 yrs","M","Non-Hispanic/Latino","White","No","Yes","No","Employed","2 to 6","MSK","Work related","Non-workers comp","Industry 4","Occupation 1","Health provider","Worker’s comp database","County B","Email",1,1,null,0,"Ineligible reason1",0,null,0,null,0,null,"2019-08-09","2019-08-15","2019-09-04",null,null,{"$f":"IF(Table1[[#This Row],[First service received]]=1,\"Never dropped\",IF(Table1[[#This Row],[Enrolled]]=1,\"No first service\",IF(Table1[[#This Row],[Expressed interest]]=1,\"Not enrolled\",IF(Table1[[#This Row],[Eligible]]=1,\"Not interested\",IF(Table1[[#This Row],[Contacted]]=1,\"Not eligible\",IF(Table1[[#This Row],[Identified]]=1,\"Not contacted\",\"\"))))))","v":"Not eligible"},{"$f":"_xlfn.CONCAT(Table1[[#This Row],[Reason not contacted]],Table1[[#This Row],[Reason not eligible]],Table1[[#This Row],[Reason not interested]],Table1[[#This Row],[Reason not enrolled]],Table1[[#This Row],[Reason first service not received]])","v":"Ineligible reason1"}]
[1207,null,"45 to 64 yrs","F","Non-Hispanic/Latino","White","Yes","Yes","No","Employed","7 to 12","Other","Non-work related","Non-workers comp","Industry 1","Occupation 3","Workforce partner","Electronic Health Records","County B","Other",1,0,"No contact info",0,null,0,null,0,null,0,null,"2019-08-09",null,null,null,null,{"$f":"IF(Table1[[#This Row],[First service received]]=1,\"Never dropped\",IF(Table1[[#This Row],[Enrolled]]=1,\"No first service\",IF(Table1[[#This Row],[Expressed interest]]=1,\"Not enrolled\",IF(Table1[[#This Row],[Eligible]]=1,\"Not interested\",IF(Table1[[#This Row],[Contacted]]=1,\"Not eligible\",IF(Table1[[#This Row],[Identified]]=1,\"Not contacted\",\"\"))))))","v":"Not contacted"},{"$f":"_xlfn.CONCAT(Table1[[#This Row],[Reason not contacted]],Table1[[#This Row],[Reason not eligible]],Table1[[#This Row],[Reason not interested]],Table1[[#This Row],[Reason not enrolled]],Table1[[#This Row],[Reason first service not received]])","v":"No contact info"}]
[1541,null,"25 to 44 yrs","F","Hispanic/Latino","White","Yes","Yes","No","Employed","7 to 12","Other","Work related","Workers comp","Industry 1","Occupation 3","Health provider","Work restriction forms","County B","Email",1,1,null,1,null,1,null,1,null,1,null,"2019-08-09","2019-08-16","2019-08-17","2019-09-03","2019-09-05",{"$f":"IF(Table1[[#This Row],[First service received]]=1,\"Never dropped\",IF(Table1[[#This Row],[Enrolled]]=1,\"No first service\",IF(Table1[[#This Row],[Expressed interest]]=1,\"Not enrolled\",IF(Table1[[#This Row],[Eligible]]=1,\"Not interested\",IF(Table1[[#This Row],[Contacted]]=1,\"Not eligible\",IF(Table1[[#This Row],[Identified]]=1,\"Not contacted\",\"\"))))))","v":"Never dropped"},{"$f":"_xlfn.CONCAT(Table1[[#This Row],[Reason not contacted]],Table1[[#This Row],[Reason not eligible]],Table1[[#This Row],[Reason not interested]],Table1[[#This Row],[Reason not enrolled]],Table1[[#This Row],[Reason first service not received]])","v":""}]
[1138,null,"25 to 44 yrs","F","Non-Hispanic/Latino","Black or African-American","No","Yes","Yes","Employed","0 to 1","MSK","Non-work related","Non-workers comp","Industry 1","Occupation 3","Health provider","Clinic appointment schedules","County B","Phone",1,1,null,1,null,0,"Impact on provider relationship",0,null,0,null,"2019-08-10","2019-08-21","2019-09-14",null,null,{"$f":"IF(Table1[[#This Row],[First service received]]=1,\"Never dropped\",IF(Table1[[#This Row],[Enrolled]]=1,\"No first service\",IF(Table1[[#This Row],[Expressed interest]]=1,\"Not enrolled\",IF(Table1[[#This Row],[Eligible]]=1,\"Not interested\",IF(Table1[[#This Row],[Contacted]]=1,\"Not eligible\",IF(Table1[[#This Row],[Identified]]=1,\"Not contacted\",\"\"))))))","v":"Not interested"},{"$f":"_xlfn.CONCAT(Table1[[#This Row],[Reason not contacted]],Table1[[#This Row],[Reason not eligible]],Table1[[#This Row],[Reason not interested]],Table1[[#This Row],[Reason not enrolled]],Table1[[#This Row],[Reason first service not received]])","v":"Impact on provider relationship"}]
[1220,null,"45 to 64 yrs","F","Non-Hispanic/Latino","White","Yes","Yes","No","Employed","0 to 1","Cardio or Respiratory","Work related","Non-workers comp","Industry 3","Occupation 2","Workforce partner","Electronic Health Records","County B","In person",1,1,null,1,null,0,"Don't want to be in research study",0,null,0,null,"2019-08-10","2019-08-22","2019-09-01",null,null,{"$f":"IF(Table1[[#This Row],[First service received]]=1,\"Never dropped\",IF(Table1[[#This Row],[Enrolled]]=1,\"No first service\",IF(Table1[[#This Row],[Expressed interest]]=1,\"Not enrolled\",IF(Table1[[#This Row],[Eligible]]=1,\"Not interested\",IF(Table1[[#This Row],[Contacted]]=1,\"Not eligible\",IF(Table1[[#This Row],[Identified]]=1,\"Not contacted\",\"\"))))))","v":"Not interested"},{"$f":"_xlfn.CONCAT(Table1[[#This Row],[Reason not contacted]],Table1[[#This Row],[Reason not eligible]],Table1[[#This Row],[Reason not interested]],Table1[[#This Row],[Reason not enrolled]],Table1[[#This Row],[Reason first service not received]])","v":"Don't want to be in research study"}]
[1447,null,"25 to 44 yrs","M","Non-Hispanic/Latino","White","Yes","Yes","No","Employed","0 to 1","MSK","Non-work related","Non-workers comp","Industry 4","Occupation 3","Workforce partner","Electronic Health Records","County A","Phone",1,1,null,0,"Ineligible reason3",0,null,0,null,0,null,"2019-08-10","2019-08-11","2019-09-24",null,null,{"$f":"IF(Table1[[#This Row],[First service received]]=1,\"Never dropped\",IF(Table1[[#This Row],[Enrolled]]=1,\"No first service\",IF(Table1[[#This Row],[Expressed interest]]=1,\"Not enrolled\",IF(Table1[[#This Row],[Eligible]]=1,\"Not interested\",IF(Table1[[#This Row],[Contacted]]=1,\"Not eligible\",IF(Table1[[#This Row],[Identified]]=1,\"Not contacted\",\"\"))))))","v":"Not eligible"},{"$f":"_xlfn.CONCAT(Table1[[#This Row],[Reason not contacted]],Table1[[#This Row],[Reason not eligible]],Table1[[#This Row],[Reason not interested]],Table1[[#This Row],[Reason not enrolled]],Table1[[#This Row],[Reason first service not received]])","v":"Ineligible reason3"}]
[1568,null,"45 to 64 yrs","F","Non-Hispanic/Latino","White","Yes","Yes","No","Not Employed","0 to 1","MSK","Non-work related","Non-workers comp","Industry 1","Occupation 3","Health provider","Clinic appointment schedules","County B","Phone",1,1,null,0,"Ineligible reason3",0,null,0,null,0,null,"2019-08-10","2019-08-19","2019-08-24",null,null,{"$f":"IF(Table1[[#This Row],[First service received]]=1,\"Never dropped\",IF(Table1[[#This Row],[Enrolled]]=1,\"No first service\",IF(Table1[[#This Row],[Expressed interest]]=1,\"Not enrolled\",IF(Table1[[#This Row],[Eligible]]=1,\"Not interested\",IF(Table1[[#This Row],[Contacted]]=1,\"Not eligible\",IF(Table1[[#This Row],[Identified]]=1,\"Not contacted\",\"\"))))))","v":"Not eligible"},{"$f":"_xlfn.CONCAT(Table1[[#This Row],[Reason not contacted]],Table1[[#This Row],[Reason not eligible]],Table1[[#This Row],[Reason not interested]],Table1[[#This Row],[Reason not enrolled]],Table1[[#This Row],[Reason first service not received]])","v":"Ineligible reason3"}]
[1142,null,"45 to 64 yrs","M","Non-Hispanic/Latino","Other or 2 or more","Yes","Yes","No","Employed","7 to 12","Other","Non-work related","Non-workers comp","Industry 1","Occupation 3","Health provider","Worker’s comp database","County A","Phone",1,1,null,1,null,1,null,1,null,1,null,"2019-08-11","2019-08-21","2019-08-31","2019-09-16","2019-09-28",{"$f":"IF(Table1[[#This Row],[First service received]]=1,\"Never dropped\",IF(Table1[[#This Row],[Enrolled]]=1,\"No first service\",IF(Table1[[#This Row],[Expressed interest]]=1,\"Not enrolled\",IF(Table1[[#This Row],[Eligible]]=1,\"Not interested\",IF(Table1[[#This Row],[Contacted]]=1,\"Not eligible\",IF(Table1[[#This Row],[Identified]]=1,\"Not contacted\",\"\"))))))","v":"Never dropped"},{"$f":"_xlfn.CONCAT(Table1[[#This Row],[Reason not contacted]],Table1[[#This Row],[Reason not eligible]],Table1[[#This Row],[Reason not interested]],Table1[[#This Row],[Reason not enrolled]],Table1[[#This Row],[Reason first service not received]])","v":""}]
[1216,null,"25 to 44 yrs","M","Hispanic/Latino","White","Yes","Yes","No","Employed","2 to 6","MSK","Non-work related","Non-workers comp","Industry 4","Occupation 3","Health provider","Work restriction forms","County B","Email",1,1,null,1,null,0,"Don't want to be in research study",0,null,0,null,"2019-08-11","2019-08-20","2019-09-27",null,null,{"$f":"IF(Table1[[#This Row],[First service received]]=1,\"Never dropped\",IF(Table1[[#This Row],[Enrolled]]=1,\"No first service\",IF(Table1[[#This Row],[Expressed interest]]=1,\"Not enrolled\",IF(Table1[[#This Row],[Eligible]]=1,\"Not interested\",IF(Table1[[#This Row],[Contacted]]=1,\"Not eligible\",IF(Table1[[#This Row],[Identified]]=1,\"Not contacted\",\"\"))))))","v":"Not interested"},{"$f":"_xlfn.CONCAT(Table1[[#This Row],[Reason not contacted]],Table1[[#This Row],[Reason not eligible]],Table1[[#This Row],[Reason not interested]],Table1[[#This Row],[Reason not enrolled]],Table1[[#This Row],[Reason first service not received]])","v":"Don't want to be in research study"}]
[1248,null,"45 to 64 yrs","M","Non-Hispanic/Latino","White","Yes","No","No","Employed","0 to 1","Cardio or Respiratory","Non-work related","Non-workers comp","Industry 1","Occupation 3","Self","Electronic Health Records","County B","Email",1,1,null,1,null,0,"Not interested reason3",0,null,0,null,"2019-08-12","2019-08-22","2019-09-26",null,null,{"$f":"IF(Table1[[#This Row],[First service received]]=1,\"Never dropped\",IF(Table1[[#This Row],[Enrolled]]=1,\"No first service\",IF(Table1[[#This Row],[Expressed interest]]=1,\"Not enrolled\",IF(Table1[[#This Row],[Eligible]]=1,\"Not interested\",IF(Table1[[#This Row],[Contacted]]=1,\"Not eligible\",IF(Table1[[#This Row],[Identified]]=1,\"Not contacted\",\"\"))))))","v":"Not interested"},{"$f":"_xlfn.CONCAT(Table1[[#This Row],[Reason not contacted]],Table1[[#This Row],[Reason not eligible]],Table1[[#This Row],[Reason not interested]],Table1[[#This Row],[Reason not enrolled]],Table1[[#This Row],[Reason first service not received]])","v":"Not interested reason3"}]
[1287,null,"45 to 64 yrs","F","Non-Hispanic/Latino","White","Yes","Yes","No","Employed","7 to 12","Other","Non-work related","Non-workers comp","Industry 1","Occupation 1","Health provider","Clinic appointment schedules","County B","In person",1,1,null,0,"Ineligible reason1",0,null,0,null,0,null,"2019-08-12","2019-08-16","2019-08-27",null,null,{"$f":"IF(Table1[[#This Row],[First service received]]=1,\"Never dropped\",IF(Table1[[#This Row],[Enrolled]]=1,\"No first service\",IF(Table1[[#This Row],[Expressed interest]]=1,\"Not enrolled\",IF(Table1[[#This Row],[Eligible]]=1,\"Not interested\",IF(Table1[[#This Row],[Contacted]]=1,\"Not eligible\",IF(Table1[[#This Row],[Identified]]=1,\"Not contacted\",\"\"))))))","v":"Not eligible"},{"$f":"_xlfn.CONCAT(Table1[[#This Row],[Reason not contacted]],Table1[[#This Row],[Reason not eligible]],Table1[[#This Row],[Reason not interested]],Table1[[#This Row],[Reason not enrolled]],Table1[[#This Row],[Reason first service not received]])","v":"Ineligible reason1"}]
[1308,null,"45 to 64 yrs","F","Non-Hispanic/Latino","Black or African-American","Yes","Yes","Yes","Employed","2 to 6","Cardio or Respiratory","Work related","Non-workers comp","Industry 3","Occupation 3","Health provider","Worker’s comp database","County B","In person",1,1,null,0,"Ineligible reason1",0,null,0,null,0,null,"2019-08-12","2019-08-21","2019-08-21",null,null,{"$f":"IF(Table1[[#This Row],[First service received]]=1,\"Never dropped\",IF(Table1[[#This Row],[Enrolled]]=1,\"No first service\",IF(Table1[[#This Row],[Expressed interest]]=1,\"Not enrolled\",IF(Table1[[#This Row],[Eligible]]=1,\"Not interested\",IF(Table1[[#This Row],[Contacted]]=1,\"Not eligible\",IF(Table1[[#This Row],[Identified]]=1,\"Not contacted\",\"\"))))))","v":"Not eligible"},{"$f":"_xlfn.CONCAT(Table1[[#This Row],[Reason not contacted]],Table1[[#This Row],[Reason not eligible]],Table1[[#This Row],[Reason not interested]],Table1[[#This Row],[Reason not enrolled]],Table1[[#This Row],[Reason first service not received]])","v":"Ineligible reason1"}]
[1377,null,"25 to 44 yrs","F","Non-Hispanic/Latino","Black or African-American","Yes","Yes","Yes","Employed","2 to 6","Cardio or Respiratory","Non-work related","Non-workers comp","Industry 1","Occupation 1","Self","Electronic Health Records","County A","Phone",1,0,"Inaccurate contact info",0,null,0,null,0,null,0,null,"2019-08-12",null,null,null,null,{"$f":"IF(Table1[[#This Row],[First service received]]=1,\"Never dropped\",IF(Table1[[#This Row],[Enrolled]]=1,\"No first service\",IF(Table1[[#This Row],[Expressed interest]]=1,\"Not enrolled\",IF(Table1[[#This Row],[Eligible]]=1,\"Not interested\",IF(Table1[[#This Row],[Contacted]]=1,\"Not eligible\",IF(Table1[[#This Row],[Identified]]=1,\"Not contacted\",\"\"))))))","v":"Not contacted"},{"$f":"_xlfn.CONCAT(Table1[[#This Row],[Reason not contacted]],Table1[[#This Row],[Reason not eligible]],Table1[[#This Row],[Reason not interested]],Table1[[#This Row],[Reason not enrolled]],Table1[[#This Row],[Reason first service not received]])","v":"Inaccurate contact info"}]
[1454,null,"45 to 64 yrs","F","Non-Hispanic/Latino","Black or African-American","Yes","Yes","No","Employed","0 to 1","Other","Non-work related","Non-workers comp","Industry 3","Occupation 2","Health provider","Worker’s comp database","County B","Phone",1,0,"Contacted, no response",0,null,0,null,0,null,0,null,"2019-08-12",null,null,null,null,{"$f":"IF(Table1[[#This Row],[First service received]]=1,\"Never dropped\",IF(Table1[[#This Row],[Enrolled]]=1,\"No first service\",IF(Table1[[#This Row],[Expressed interest]]=1,\"Not enrolled\",IF(Table1[[#This Row],[Eligible]]=1,\"Not interested\",IF(Table1[[#This Row],[Contacted]]=1,\"Not eligible\",IF(Table1[[#This Row],[Identified]]=1,\"Not contacted\",\"\"))))))","v":"Not contacted"},{"$f":"_xlfn.CONCAT(Table1[[#This Row],[Reason not contacted]],Table1[[#This Row],[Reason not eligible]],Table1[[#This Row],[Reason not interested]],Table1[[#This Row],[Reason not enrolled]],Table1[[#This Row],[Reason first service not received]])","v":"Contacted, no response"}]
[1008,"lorem ipsum","45 to 64 yrs","M","Non-Hispanic/Latino","White","Yes","Yes","No","Self-employed","13+ weeks","Cardio or Respiratory","Non-work related","Non-workers comp","Industry 2","Occupation 1","Health provider","Clinic appointment schedules","County B","In person",1,1,null,1,null,1,null,1,null,1,null,"2019-08-13","2019-08-22","2019-08-23","2019-09-05","2019-09-11",{"$f":"IF(Table1[[#This Row],[First service received]]=1,\"Never dropped\",IF(Table1[[#This Row],[Enrolled]]=1,\"No first service\",IF(Table1[[#This Row],[Expressed interest]]=1,\"Not enrolled\",IF(Table1[[#This Row],[Eligible]]=1,\"Not interested\",IF(Table1[[#This Row],[Contacted]]=1,\"Not eligible\",IF(Table1[[#This Row],[Identified]]=1,\"Not contacted\",\"\"))))))","v":"Never dropped"},{"$f":"_xlfn.CONCAT(Table1[[#This Row],[Reason not contacted]],Table1[[#This Row],[Reason not eligible]],Table1[[#This Row],[Reason not interested]],Table1[[#This Row],[Reason not enrolled]],Table1[[#This Row],[Reason first service not received]])","v":""}]
[1074,null,"18 to 24 yrs","M","Hispanic/Latino","White","Yes","No","Yes","Employed","7 to 12","MSK","Work related","Workers comp","Industry 1","Occupation 3","Health provider","Worker’s comp database","County C","Other",1,0,"No contact info",0,null,0,null,0,null,0,null,"2019-08-13",null,null,null,null,{"$f":"IF(Table1[[#This Row],[First service received]]=1,\"Never dropped\",IF(Table1[[#This Row],[Enrolled]]=1,\"No first service\",IF(Table1[[#This Row],[Expressed interest]]=1,\"Not enrolled\",IF(Table1[[#This Row],[Eligible]]=1,\"Not interested\",IF(Table1[[#This Row],[Contacted]]=1,\"Not eligible\",IF(Table1[[#This Row],[Identified]]=1,\"Not contacted\",\"\"))))))","v":"Not contacted"},{"$f":"_xlfn.CONCAT(Table1[[#This Row],[Reason not contacted]],Table1[[#This Row],[Reason not eligible]],Table1[[#This Row],[Reason not interested]],Table1[[#This Row],[Reason not enrolled]],Table1[[#This Row],[Reason first service not received]])","v":"No contact info"}]
[1266,null,"18 to 24 yrs","F","Non-Hispanic/Latino","White","Yes","No","No","Employed","2 to 6","Cardio or Respiratory","Work related","Non-workers comp","Industry 3","Occupation 1","Employer","Electronic Health Records","County B","Phone",1,1,null,1,null,1,null,1,null,1,null,"2019-08-13","2019-08-25","2019-08-28","2019-09-22","2019-09-23",{"$f":"IF(Table1[[#This Row],[First service received]]=1,\"Never dropped\",IF(Table1[[#This Row],[Enrolled]]=1,\"No first service\",IF(Table1[[#This Row],[Expressed interest]]=1,\"Not enrolled\",IF(Table1[[#This Row],[Eligible]]=1,\"Not interested\",IF(Table1[[#This Row],[Contacted]]=1,\"Not eligible\",IF(Table1[[#This Row],[Identified]]=1,\"Not contacted\",\"\"))))))","v":"Never dropped"},{"$f":"_xlfn.CONCAT(Table1[[#This Row],[Reason not contacted]],Table1[[#This Row],[Reason not eligible]],Table1[[#This Row],[Reason not interested]],Table1[[#This Row],[Reason not enrolled]],Table1[[#This Row],[Reason first service not received]])","v":""}]
[1335,null,"45 to 64 yrs","M","Non-Hispanic/Latino","White","No","Yes","No","Employed","2 to 6","MSK","Non-work related","Non-workers comp","Industry 2","Occupation 3","Health provider","Work restriction forms","County B","Email",1,1,null,1,null,0,"Impact on provider relationship",0,null,0,null,"2019-08-13","2019-08-26","2019-10-01",null,null,{"$f":"IF(Table1[[#This Row],[First service received]]=1,\"Never dropped\",IF(Table1[[#This Row],[Enrolled]]=1,\"No first service\",IF(Table1[[#This Row],[Expressed interest]]=1,\"Not enrolled\",IF(Table1[[#This Row],[Eligible]]=1,\"Not interested\",IF(Table1[[#This Row],[Contacted]]=1,\"Not eligible\",IF(Table1[[#This Row],[Identified]]=1,\"Not contacted\",\"\"))))))","v":"Not interested"},{"$f":"_xlfn.CONCAT(Table1[[#This Row],[Reason not contacted]],Table1[[#This Row],[Reason not eligible]],Table1[[#This Row],[Reason not interested]],Table1[[#This Row],[Reason not enrolled]],Table1[[#This Row],[Reason first service not received]])","v":"Impact on provider relationship"}]
[1379,null,"45 to 64 yrs","M","Non-Hispanic/Latino","White","Yes","Yes","No","Employed","2 to 6","MSK","Work related","Workers comp","Industry 3","Occupation 2","Health provider","Worker’s comp database","County B","In person",1,1,null,1,null,1,null,0,"Not enrolled reason1",0,null,"2019-08-13","2019-08-21","2019-09-25",null,null,{"$f":"IF(Table1[[#This Row],[First service received]]=1,\"Never dropped\",IF(Table1[[#This Row],[Enrolled]]=1,\"No first service\",IF(Table1[[#This Row],[Expressed interest]]=1,\"Not enrolled\",IF(Table1[[#This Row],[Eligible]]=1,\"Not interested\",IF(Table1[[#This Row],[Contacted]]=1,\"Not eligible\",IF(Table1[[#This Row],[Identified]]=1,\"Not contacted\",\"\"))))))","v":"Not enrolled"},{"$f":"_xlfn.CONCAT(Table1[[#This Row],[Reason not contacted]],Table1[[#This Row],[Reason not eligible]],Table1[[#This Row],[Reason not interested]],Table1[[#This Row],[Reason not enrolled]],Table1[[#This Row],[Reason first service not received]])","v":"Not enrolled reason1"}]
[1544,null,"25 to 44 yrs","M","Non-Hispanic/Latino","Hawaiian or Pacific Islander","Yes","Yes","No","Employed","2 to 6","MSK","Non-work related","Non-workers comp","Industry 1","Occupation 3","Health provider","Clinic appointment schedules","County B","In person",1,0,"Contacted, no response",0,null,0,null,0,null,0,null,"2019-08-13",null,null,null,null,{"$f":"IF(Table1[[#This Row],[First service received]]=1,\"Never dropped\",IF(Table1[[#This Row],[Enrolled]]=1,\"No first service\",IF(Table1[[#This Row],[Expressed interest]]=1,\"Not enrolled\",IF(Table1[[#This Row],[Eligible]]=1,\"Not interested\",IF(Table1[[#This Row],[Contacted]]=1,\"Not eligible\",IF(Table1[[#This Row],[Identified]]=1,\"Not contacted\",\"\"))))))","v":"Not contacted"},{"$f":"_xlfn.CONCAT(Table1[[#This Row],[Reason not contacted]],Table1[[#This Row],[Reason not eligible]],Table1[[#This Row],[Reason not interested]],Table1[[#This Row],[Reason not enrolled]],Table1[[#This Row],[Reason first service not received]])","v":"Contacted, no response"}]
[1052,null,"45 to 64 yrs","M","Non-Hispanic/Latino","Black or African-American","Yes","Yes","No","Not Employed","0 to 1","MSK","Non-work related","Non-workers comp","Industry 1","Occupation 3","Health provider","Work restriction forms","County B","Phone",1,1,null,1,null,1,null,1,null,0,"No show","2019-08-14","2019-08-15","2019-08-27","2019-09-02",null,{"$f":"IF(Table1[[#This Row],[First service received]]=1,\"Never dropped\",IF(Table1[[#This Row],[Enrolled]]=1,\"No first service\",IF(Table1[[#This Row],[Expressed interest]]=1,\"Not enrolled\",IF(Table1[[#This Row],[Eligible]]=1,\"Not interested\",IF(Table1[[#This Row],[Contacted]]=1,\"Not eligible\",IF(Table1[[#This Row],[Identified]]=1,\"Not contacted\",\"\"))))))","v":"No first service"},{"$f":"_xlfn.CONCAT(Table1[[#This Row],[Reason not contacted]],Table1[[#This Row],[Reason not eligible]],Table1[[#This Row],[Reason not interested]],Table1[[#This Row],[Reason not enrolled]],Table1[[#This Row],[Reason first service not received]])","v":"No show"}]
[1261,null,"18 to 24 yrs","F","Non-Hispanic/Latino","Asian","Yes","Yes","No","Employed","7 to 12","MSK","Work related","Non-workers comp","Industry 2","Occupation 3","Health provider","Voc rehab centers","County B","In person",1,1,null,1,null,1,null,1,null,1,null,"2019-08-14","2019-08-29","2019-09-07","2019-09-24","2019-09-29",{"$f":"IF(Table1[[#This Row],[First service received]]=1,\"Never dropped\",IF(Table1[[#This Row],[Enrolled]]=1,\"No first service\",IF(Table1[[#This Row],[Expressed interest]]=1,\"Not enrolled\",IF(Table1[[#This Row],[Eligible]]=1,\"Not interested\",IF(Table1[[#This Row],[Contacted]]=1,\"Not eligible\",IF(Table1[[#This Row],[Identified]]=1,\"Not contacted\",\"\"))))))","v":"Never dropped"},{"$f":"_xlfn.CONCAT(Table1[[#This Row],[Reason not contacted]],Table1[[#This Row],[Reason not eligible]],Table1[[#This Row],[Reason not interested]],Table1[[#This Row],[Reason not enrolled]],Table1[[#This Row],[Reason first service not received]])","v":""}]
[1504,null,"45 to 64 yrs","F","Non-Hispanic/Latino","White","Yes","Yes","No","Employed","2 to 6","MSK","Work related","Non-workers comp","Industry 1","Occupation 3","Health provider","Voc rehab centers","County B","Email",1,1,null,0,"Ineligible reason1",0,null,0,null,0,null,"2019-08-14","2019-08-28","2019-10-06",null,null,{"$f":"IF(Table1[[#This Row],[First service received]]=1,\"Never dropped\",IF(Table1[[#This Row],[Enrolled]]=1,\"No first service\",IF(Table1[[#This Row],[Expressed interest]]=1,\"Not enrolled\",IF(Table1[[#This Row],[Eligible]]=1,\"Not interested\",IF(Table1[[#This Row],[Contacted]]=1,\"Not eligible\",IF(Table1[[#This Row],[Identified]]=1,\"Not contacted\",\"\"))))))","v":"Not eligible"},{"$f":"_xlfn.CONCAT(Table1[[#This Row],[Reason not contacted]],Table1[[#This Row],[Reason not eligible]],Table1[[#This Row],[Reason not interested]],Table1[[#This Row],[Reason not enrolled]],Table1[[#This Row],[Reason first service not received]])","v":"Ineligible reason1"}]
[1528,null,"18 to 24 yrs","M","Non-Hispanic/Latino","Black or African-American","Yes","Yes","No","Employed","7 to 12","MSK","Non-work related","Non-workers comp","Industry 3","Occupation 1","Health provider","Clinic appointment schedules","County B","Other",1,0,"No contact info",0,null,0,null,0,null,0,null,"2019-08-14",null,null,null,null,{"$f":"IF(Table1[[#This Row],[First service received]]=1,\"Never dropped\",IF(Table1[[#This Row],[Enrolled]]=1,\"No first service\",IF(Table1[[#This Row],[Expressed interest]]=1,\"Not enrolled\",IF(Table1[[#This Row],[Eligible]]=1,\"Not interested\",IF(Table1[[#This Row],[Contacted]]=1,\"Not eligible\",IF(Table1[[#This Row],[Identified]]=1,\"Not contacted\",\"\"))))))","v":"Not contacted"},{"$f":"_xlfn.CONCAT(Table1[[#This Row],[Reason not contacted]],Table1[[#This Row],[Reason not eligible]],Table1[[#This Row],[Reason not interested]],Table1[[#This Row],[Reason not enrolled]],Table1[[#This Row],[Reason first service not received]])","v":"No contact info"}]
[1167,null,"25 to 44 yrs","M","Non-Hispanic/Latino","White","Yes","Yes","No","Not Employed","0 to 1","MSK","Work related","Non-workers comp","Industry 2","Occupation 3","Health provider","Worker’s comp database","County B","In person",1,0,"Contacted, no response",0,null,0,null,0,null,0,null,"2019-08-15",null,null,null,null,{"$f":"IF(Table1[[#This Row],[First service received]]=1,\"Never dropped\",IF(Table1[[#This Row],[Enrolled]]=1,\"No first service\",IF(Table1[[#This Row],[Expressed interest]]=1,\"Not enrolled\",IF(Table1[[#This Row],[Eligible]]=1,\"Not interested\",IF(Table1[[#This Row],[Contacted]]=1,\"Not eligible\",IF(Table1[[#This Row],[Identified]]=1,\"Not contacted\",\"\"))))))","v":"Not contacted"},{"$f":"_xlfn.CONCAT(Table1[[#This Row],[Reason not contacted]],Table1[[#This Row],[Reason not eligible]],Table1[[#This Row],[Reason not interested]],Table1[[#This Row],[Reason not enrolled]],Table1[[#This Row],[Reason first service not received]])","v":"Contacted, no response"}]
[1295,null,"25 to 44 yrs","M","Non-Hispanic/Latino","White","Yes","Yes","No","Employed","2 to 6","MSK","Work related","Non-workers comp","Industry 1","Occupation 3","Health provider","Worker’s comp database","County B","Phone",1,1,null,1,null,1,null,1,null,1,null,"2019-08-15","2019-08-25","2019-08-26","2019-09-08","2019-09-18",{"$f":"IF(Table1[[#This Row],[First service received]]=1,\"Never dropped\",IF(Table1[[#This Row],[Enrolled]]=1,\"No first service\",IF(Table1[[#This Row],[Expressed interest]]=1,\"Not enrolled\",IF(Table1[[#This Row],[Eligible]]=1,\"Not interested\",IF(Table1[[#This Row],[Contacted]]=1,\"Not eligible\",IF(Table1[[#This Row],[Identified]]=1,\"Not contacted\",\"\"))))))","v":"Never dropped"},{"$f":"_xlfn.CONCAT(Table1[[#This Row],[Reason not contacted]],Table1[[#This Row],[Reason not eligible]],Table1[[#This Row],[Reason not interested]],Table1[[#This Row],[Reason not enrolled]],Table1[[#This Row],[Reason first service not received]])","v":""}]
[1503,null,"45 to 64 yrs","M","Non-Hispanic/Latino","Hawaiian or Pacific Islander","Yes","Yes","No","Employed","2 to 6","MSK","Non-work related","Non-workers comp","Industry 2","Occupation 3","Health provider","Voc rehab centers","County C","Phone",1,1,null,0,"Ineligible reason2",0,null,0,null,0,null,"2019-08-15","2019-08-28","2019-08-28",null,null,{"$f":"IF(Table1[[#This Row],[First service received]]=1,\"Never dropped\",IF(Table1[[#This Row],[Enrolled]]=1,\"No first service\",IF(Table1[[#This Row],[Expressed interest]]=1,\"Not enrolled\",IF(Table1[[#This Row],[Eligible]]=1,\"Not interested\",IF(Table1[[#This Row],[Contacted]]=1,\"Not eligible\",IF(Table1[[#This Row],[Identified]]=1,\"Not contacted\",\"\"))))))","v":"Not eligible"},{"$f":"_xlfn.CONCAT(Table1[[#This Row],[Reason not contacted]],Table1[[#This Row],[Reason not eligible]],Table1[[#This Row],[Reason not interested]],Table1[[#This Row],[Reason not enrolled]],Table1[[#This Row],[Reason first service not received]])","v":"Ineligible reason2"}]
[1118,null,"25 to 44 yrs","M","Non-Hispanic/Latino","White","Yes","Yes","No","Employed","0 to 1","MSK","Work related","Workers comp","Industry 3","Occupation 3","Employer","Electronic Health Records","County A","In person",1,0,"Contacted, no response",0,null,0,null,0,null,0,null,"2019-08-16",null,null,null,null,{"$f":"IF(Table1[[#This Row],[First service received]]=1,\"Never dropped\",IF(Table1[[#This Row],[Enrolled]]=1,\"No first service\",IF(Table1[[#This Row],[Expressed interest]]=1,\"Not enrolled\",IF(Table1[[#This Row],[Eligible]]=1,\"Not interested\",IF(Table1[[#This Row],[Contacted]]=1,\"Not eligible\",IF(Table1[[#This Row],[Identified]]=1,\"Not contacted\",\"\"))))))","v":"Not contacted"},{"$f":"_xlfn.CONCAT(Table1[[#This Row],[Reason not contacted]],Table1[[#This Row],[Reason not eligible]],Table1[[#This Row],[Reason not interested]],Table1[[#This Row],[Reason not enrolled]],Table1[[#This Row],[Reason first service not received]])","v":"Contacted, no response"}]
[1337,null,"25 to 44 yrs","M","Hispanic/Latino","White","Yes","Yes","No","Employed","7 to 12","MSK","Non-work related","Non-workers comp","Industry 3","Occupation 2","Health provider","Work restriction forms","County B","In person",1,1,null,1,null,1,null,1,null,1,null,"2019-08-16","2019-08-26","2019-09-02","2019-09-24","2019-10-08",{"$f":"IF(Table1[[#This Row],[First service received]]=1,\"Never dropped\",IF(Table1[[#This Row],[Enrolled]]=1,\"No first service\",IF(Table1[[#This Row],[Expressed interest]]=1,\"Not enrolled\",IF(Table1[[#This Row],[Eligible]]=1,\"Not interested\",IF(Table1[[#This Row],[Contacted]]=1,\"Not eligible\",IF(Table1[[#This Row],[Identified]]=1,\"Not contacted\",\"\"))))))","v":"Never dropped"},{"$f":"_xlfn.CONCAT(Table1[[#This Row],[Reason not contacted]],Table1[[#This Row],[Reason not eligible]],Table1[[#This Row],[Reason not interested]],Table1[[#This Row],[Reason not enrolled]],Table1[[#This Row],[Reason first service not received]])","v":""}]
[1554,null,"25 to 44 yrs","F","Non-Hispanic/Latino","White","Yes","Yes","No","Employed","2 to 6","MSK","Non-work related","Non-workers comp","Industry 3","Occupation 2","Health provider","Clinic appointment schedules","County B","In person",1,1,null,1,null,0,"Impact on provider relationship",0,null,0,null,"2019-08-16","2019-08-21","2019-09-11",null,null,{"$f":"IF(Table1[[#This Row],[First service received]]=1,\"Never dropped\",IF(Table1[[#This Row],[Enrolled]]=1,\"No first service\",IF(Table1[[#This Row],[Expressed interest]]=1,\"Not enrolled\",IF(Table1[[#This Row],[Eligible]]=1,\"Not interested\",IF(Table1[[#This Row],[Contacted]]=1,\"Not eligible\",IF(Table1[[#This Row],[Identified]]=1,\"Not contacted\",\"\"))))))","v":"Not interested"},{"$f":"_xlfn.CONCAT(Table1[[#This Row],[Reason not contacted]],Table1[[#This Row],[Reason not eligible]],Table1[[#This Row],[Reason not interested]],Table1[[#This Row],[Reason not enrolled]],Table1[[#This Row],[Reason first service not received]])","v":"Impact on provider relationship"}]
[1045,null,"18 to 24 yrs","M","Non-Hispanic/Latino","Other or 2 or more","Yes","Yes","No","Employed","7 to 12","MSK","Non-work related","Non-workers comp","Industry 1","Occupation 3","Health provider","Clinic appointment schedules","County B","In person",1,1,null,0,"Ineligible reason3",0,null,0,null,0,null,"2019-08-17","2019-08-25","2019-08-26",null,null,{"$f":"IF(Table1[[#This Row],[First service received]]=1,\"Never dropped\",IF(Table1[[#This Row],[Enrolled]]=1,\"No first service\",IF(Table1[[#This Row],[Expressed interest]]=1,\"Not enrolled\",IF(Table1[[#This Row],[Eligible]]=1,\"Not interested\",IF(Table1[[#This Row],[Contacted]]=1,\"Not eligible\",IF(Table1[[#This Row],[Identified]]=1,\"Not contacted\",\"\"))))))","v":"Not eligible"},{"$f":"_xlfn.CONCAT(Table1[[#This Row],[Reason not contacted]],Table1[[#This Row],[Reason not eligible]],Table1[[#This Row],[Reason not interested]],Table1[[#This Row],[Reason not enrolled]],Table1[[#This Row],[Reason first service not received]])","v":"Ineligible reason3"}]
[1084,null,"45 to 64 yrs","M","Non-Hispanic/Latino","Black or African-American","Yes","No","No","Employed","0 to 1","MSK","Work related","Non-workers comp","Industry 3","Occupation 2","Health provider","Clinic appointment schedules","County B","In person",1,1,null,1,null,1,null,1,null,1,null,"2019-08-17","2019-08-31","2019-09-07","2019-09-29","2019-10-02",{"$f":"IF(Table1[[#This Row],[First service received]]=1,\"Never dropped\",IF(Table1[[#This Row],[Enrolled]]=1,\"No first service\",IF(Table1[[#This Row],[Expressed interest]]=1,\"Not enrolled\",IF(Table1[[#This Row],[Eligible]]=1,\"Not interested\",IF(Table1[[#This Row],[Contacted]]=1,\"Not eligible\",IF(Table1[[#This Row],[Identified]]=1,\"Not contacted\",\"\"))))))","v":"Never dropped"},{"$f":"_xlfn.CONCAT(Table1[[#This Row],[Reason not contacted]],Table1[[#This Row],[Reason not eligible]],Table1[[#This Row],[Reason not interested]],Table1[[#This Row],[Reason not enrolled]],Table1[[#This Row],[Reason first service not received]])","v":""}]
[1159,null,"45 to 64 yrs","F","Non-Hispanic/Latino","White","Yes","Yes","No","Employed","2 to 6","MSK","Non-work related","Non-workers comp","Industry 4","Occupation 3","Health provider","Voc rehab centers","County B","Email",1,1,null,1,null,1,null,1,null,1,null,"2019-08-17","2019-08-29","2019-09-12","2019-09-28","2019-10-07",{"$f":"IF(Table1[[#This Row],[First service received]]=1,\"Never dropped\",IF(Table1[[#This Row],[Enrolled]]=1,\"No first service\",IF(Table1[[#This Row],[Expressed interest]]=1,\"Not enrolled\",IF(Table1[[#This Row],[Eligible]]=1,\"Not interested\",IF(Table1[[#This Row],[Contacted]]=1,\"Not eligible\",IF(Table1[[#This Row],[Identified]]=1,\"Not contacted\",\"\"))))))","v":"Never dropped"},{"$f":"_xlfn.CONCAT(Table1[[#This Row],[Reason not contacted]],Table1[[#This Row],[Reason not eligible]],Table1[[#This Row],[Reason not interested]],Table1[[#This Row],[Reason not enrolled]],Table1[[#This Row],[Reason first service not received]])","v":""}]
[1466,null,"25 to 44 yrs","F","Non-Hispanic/Latino","American Indian or Alaska Native","No","Yes","No","Employed","2 to 6","MSK","Non-work related","Non-workers comp","Industry 1","Occupation 3","Health provider","Worker’s comp database","County B","Email",1,1,null,0,"Ineligible reason3",0,null,0,null,0,null,"2019-08-17","2019-08-22","2019-09-06",null,null,{"$f":"IF(Table1[[#This Row],[First service received]]=1,\"Never dropped\",IF(Table1[[#This Row],[Enrolled]]=1,\"No first service\",IF(Table1[[#This Row],[Expressed interest]]=1,\"Not enrolled\",IF(Table1[[#This Row],[Eligible]]=1,\"Not interested\",IF(Table1[[#This Row],[Contacted]]=1,\"Not eligible\",IF(Table1[[#This Row],[Identified]]=1,\"Not contacted\",\"\"))))))","v":"Not eligible"},{"$f":"_xlfn.CONCAT(Table1[[#This Row],[Reason not contacted]],Table1[[#This Row],[Reason not eligible]],Table1[[#This Row],[Reason not interested]],Table1[[#This Row],[Reason not enrolled]],Table1[[#This Row],[Reason first service not received]])","v":"Ineligible reason3"}]
[1530,null,"25 to 44 yrs","F","Hispanic/Latino","White","Yes","Yes","No","Employed","2 to 6","Other","Non-work related","Non-workers comp","Industry 3","Occupation 2","Health provider","Worker’s comp database","County B","Phone",1,0,"Contacted, no response",0,null,0,null,0,null,0,null,"2019-08-17",null,null,null,null,{"$f":"IF(Table1[[#This Row],[First service received]]=1,\"Never dropped\",IF(Table1[[#This Row],[Enrolled]]=1,\"No first service\",IF(Table1[[#This Row],[Expressed interest]]=1,\"Not enrolled\",IF(Table1[[#This Row],[Eligible]]=1,\"Not interested\",IF(Table1[[#This Row],[Contacted]]=1,\"Not eligible\",IF(Table1[[#This Row],[Identified]]=1,\"Not contacted\",\"\"))))))","v":"Not contacted"},{"$f":"_xlfn.CONCAT(Table1[[#This Row],[Reason not contacted]],Table1[[#This Row],[Reason not eligible]],Table1[[#This Row],[Reason not interested]],Table1[[#This Row],[Reason not enrolled]],Table1[[#This Row],[Reason first service not received]])","v":"Contacted, no response"}]
[1150,null,"25 to 44 yrs","F","Non-Hispanic/Latino","Black or African-American","Yes","Yes","No","Employed","2 to 6","MSK","Work related","Workers comp","Industry 3","Occupation 4","Employer","Electronic Health Records","County A","Email",1,1,null,1,null,0,"Don't want to be in research study",0,null,0,null,"2019-08-18","2019-08-19","2019-09-22",null,null,{"$f":"IF(Table1[[#This Row],[First service received]]=1,\"Never dropped\",IF(Table1[[#This Row],[Enrolled]]=1,\"No first service\",IF(Table1[[#This Row],[Expressed interest]]=1,\"Not enrolled\",IF(Table1[[#This Row],[Eligible]]=1,\"Not interested\",IF(Table1[[#This Row],[Contacted]]=1,\"Not eligible\",IF(Table1[[#This Row],[Identified]]=1,\"Not contacted\",\"\"))))))","v":"Not interested"},{"$f":"_xlfn.CONCAT(Table1[[#This Row],[Reason not contacted]],Table1[[#This Row],[Reason not eligible]],Table1[[#This Row],[Reason not interested]],Table1[[#This Row],[Reason not enrolled]],Table1[[#This Row],[Reason first service not received]])","v":"Don't want to be in research study"}]
[1218,null,"45 to 64 yrs","M","Non-Hispanic/Latino","American Indian or Alaska Native","Yes","Yes","No","Employed","7 to 12","MSK","Work related","Non-workers comp","Industry 3","Occupation 2","Self","Electronic Health Records","County A","Phone",1,0,"Contacted, no response",0,null,0,null,0,null,0,null,"2019-08-18",null,null,null,null,{"$f":"IF(Table1[[#This Row],[First service received]]=1,\"Never dropped\",IF(Table1[[#This Row],[Enrolled]]=1,\"No first service\",IF(Table1[[#This Row],[Expressed interest]]=1,\"Not enrolled\",IF(Table1[[#This Row],[Eligible]]=1,\"Not interested\",IF(Table1[[#This Row],[Contacted]]=1,\"Not eligible\",IF(Table1[[#This Row],[Identified]]=1,\"Not contacted\",\"\"))))))","v":"Not contacted"},{"$f":"_xlfn.CONCAT(Table1[[#This Row],[Reason not contacted]],Table1[[#This Row],[Reason not eligible]],Table1[[#This Row],[Reason not interested]],Table1[[#This Row],[Reason not enrolled]],Table1[[#This Row],[Reason first service not received]])","v":"Contacted, no response"}]
[1474,null,"45 to 64 yrs","F","Non-Hispanic/Latino","White","Yes","Yes","No","Employed","13+ weeks","MSK","Non-work related","Non-workers comp","Industry 2","Occupation 3","Health provider","Worker’s comp database","County A","Email",1,1,null,1,null,0,"Don't want to be in research study",0,null,0,null,"2019-08-18","2019-08-31","2019-10-08",null,null,{"$f":"IF(Table1[[#This Row],[First service received]]=1,\"Never dropped\",IF(Table1[[#This Row],[Enrolled]]=1,\"No first service\",IF(Table1[[#This Row],[Expressed interest]]=1,\"Not enrolled\",IF(Table1[[#This Row],[Eligible]]=1,\"Not interested\",IF(Table1[[#This Row],[Contacted]]=1,\"Not eligible\",IF(Table1[[#This Row],[Identified]]=1,\"Not contacted\",\"\"))))))","v":"Not interested"},{"$f":"_xlfn.CONCAT(Table1[[#This Row],[Reason not contacted]],Table1[[#This Row],[Reason not eligible]],Table1[[#This Row],[Reason not interested]],Table1[[#This Row],[Reason not enrolled]],Table1[[#This Row],[Reason first service not received]])","v":"Don't want to be in research study"}]
[1520,null,"45 to 64 yrs","F","Non-Hispanic/Latino","Asian","Yes","Yes","No","Employed","2 to 6","MSK","Non-work related","Non-workers comp","Industry 3","Occupation 4","Health provider","Worker’s comp database","County B","Email",1,1,null,1,null,1,null,1,null,1,null,"2019-08-18","2019-08-23","2019-08-24","2019-09-10","2019-09-12",{"$f":"IF(Table1[[#This Row],[First service received]]=1,\"Never dropped\",IF(Table1[[#This Row],[Enrolled]]=1,\"No first service\",IF(Table1[[#This Row],[Expressed interest]]=1,\"Not enrolled\",IF(Table1[[#This Row],[Eligible]]=1,\"Not interested\",IF(Table1[[#This Row],[Contacted]]=1,\"Not eligible\",IF(Table1[[#This Row],[Identified]]=1,\"Not contacted\",\"\"))))))","v":"Never dropped"},{"$f":"_xlfn.CONCAT(Table1[[#This Row],[Reason not contacted]],Table1[[#This Row],[Reason not eligible]],Table1[[#This Row],[Reason not interested]],Table1[[#This Row],[Reason not enrolled]],Table1[[#This Row],[Reason first service not received]])","v":""}]
[1584,null,"25 to 44 yrs","M","Non-Hispanic/Latino","White","Yes","Yes","No","Employed","2 to 6","Other","Non-work related","Non-workers comp","Industry 1","Occupation 1","Health provider","Voc rehab centers","County B","In person",1,1,null,0,"Ineligible reason1",0,null,0,null,0,null,"2019-08-18","2019-08-22","2019-09-10",null,null,{"$f":"IF(Table1[[#This Row],[First service received]]=1,\"Never dropped\",IF(Table1[[#This Row],[Enrolled]]=1,\"No first service\",IF(Table1[[#This Row],[Expressed interest]]=1,\"Not enrolled\",IF(Table1[[#This Row],[Eligible]]=1,\"Not interested\",IF(Table1[[#This Row],[Contacted]]=1,\"Not eligible\",IF(Table1[[#This Row],[Identified]]=1,\"Not contacted\",\"\"))))))","v":"Not eligible"},{"$f":"_xlfn.CONCAT(Table1[[#This Row],[Reason not contacted]],Table1[[#This Row],[Reason not eligible]],Table1[[#This Row],[Reason not interested]],Table1[[#This Row],[Reason not enrolled]],Table1[[#This Row],[Reason first service not received]])","v":"Ineligible reason1"}]
[1204,null,"45 to 64 yrs","M","Non-Hispanic/Latino","White","Yes","Yes","No","Not Employed","0 to 1","MSK","Work related","Workers comp","Industry 3","Occupation 2","Health provider","Worker’s comp database","County B","In person",1,1,null,1,null,1,null,1,null,1,null,"2019-08-19","2019-08-26","2019-09-06","2019-09-18","2019-09-28",{"$f":"IF(Table1[[#This Row],[First service received]]=1,\"Never dropped\",IF(Table1[[#This Row],[Enrolled]]=1,\"No first service\",IF(Table1[[#This Row],[Expressed interest]]=1,\"Not enrolled\",IF(Table1[[#This Row],[Eligible]]=1,\"Not interested\",IF(Table1[[#This Row],[Contacted]]=1,\"Not eligible\",IF(Table1[[#This Row],[Identified]]=1,\"Not contacted\",\"\"))))))","v":"Never dropped"},{"$f":"_xlfn.CONCAT(Table1[[#This Row],[Reason not contacted]],Table1[[#This Row],[Reason not eligible]],Table1[[#This Row],[Reason not interested]],Table1[[#This Row],[Reason not enrolled]],Table1[[#This Row],[Reason first service not received]])","v":""}]
[1171,null,"45 to 64 yrs","M","Non-Hispanic/Latino","White","Yes","No","No","Not Employed","0 to 1","Other","Non-work related","Non-workers comp","Industry 1","Occupation 3","Workforce partner","Electronic Health Records","County B","In person",1,1,null,0,"Ineligible reason1",0,null,0,null,0,null,"2019-08-20","2019-09-01","2019-09-23",null,null,{"$f":"IF(Table1[[#This Row],[First service received]]=1,\"Never dropped\",IF(Table1[[#This Row],[Enrolled]]=1,\"No first service\",IF(Table1[[#This Row],[Expressed interest]]=1,\"Not enrolled\",IF(Table1[[#This Row],[Eligible]]=1,\"Not interested\",IF(Table1[[#This Row],[Contacted]]=1,\"Not eligible\",IF(Table1[[#This Row],[Identified]]=1,\"Not contacted\",\"\"))))))","v":"Not eligible"},{"$f":"_xlfn.CONCAT(Table1[[#This Row],[Reason not contacted]],Table1[[#This Row],[Reason not eligible]],Table1[[#This Row],[Reason not interested]],Table1[[#This Row],[Reason not enrolled]],Table1[[#This Row],[Reason first service not received]])","v":"Ineligible reason1"}]
[1224,null,"25 to 44 yrs","M","Non-Hispanic/Latino","American Indian or Alaska Native","Yes","Yes","No","Employed","7 to 12","MSK","Work related","Non-workers comp","Industry 4","Occupation 1","Health provider","Clinic appointment schedules","County B","Email",1,1,null,1,null,1,null,1,null,1,null,"2019-08-20","2019-08-23","2019-08-23","2019-09-15","2019-09-23",{"$f":"IF(Table1[[#This Row],[First service received]]=1,\"Never dropped\",IF(Table1[[#This Row],[Enrolled]]=1,\"No first service\",IF(Table1[[#This Row],[Expressed interest]]=1,\"Not enrolled\",IF(Table1[[#This Row],[Eligible]]=1,\"Not interested\",IF(Table1[[#This Row],[Contacted]]=1,\"Not eligible\",IF(Table1[[#This Row],[Identified]]=1,\"Not contacted\",\"\"))))))","v":"Never dropped"},{"$f":"_xlfn.CONCAT(Table1[[#This Row],[Reason not contacted]],Table1[[#This Row],[Reason not eligible]],Table1[[#This Row],[Reason not interested]],Table1[[#This Row],[Reason not enrolled]],Table1[[#This Row],[Reason first service not received]])","v":""}]
[1368,null,"45 to 64 yrs","M","Non-Hispanic/Latino","Black or African-American","No","Yes","No","Not Employed","0 to 1","MSK","Non-work related","Non-workers comp","Industry 2","Occupation 4","Health provider","Worker’s comp database","County A","In person",1,1,null,1,null,0,"Not interested reason3",0,null,0,null,"2019-08-20","2019-09-01","2019-09-15",null,null,{"$f":"IF(Table1[[#This Row],[First service received]]=1,\"Never dropped\",IF(Table1[[#This Row],[Enrolled]]=1,\"No first service\",IF(Table1[[#This Row],[Expressed interest]]=1,\"Not enrolled\",IF(Table1[[#This Row],[Eligible]]=1,\"Not interested\",IF(Table1[[#This Row],[Contacted]]=1,\"Not eligible\",IF(Table1[[#This Row],[Identified]]=1,\"Not contacted\",\"\"))))))","v":"Not interested"},{"$f":"_xlfn.CONCAT(Table1[[#This Row],[Reason not contacted]],Table1[[#This Row],[Reason not eligible]],Table1[[#This Row],[Reason not interested]],Table1[[#This Row],[Reason not enrolled]],Table1[[#This Row],[Reason first service not received]])","v":"Not interested reason3"}]
[1510,null,"25 to 44 yrs","M","Non-Hispanic/Latino","Black or African-American","Yes","Yes","No","Not Employed","0 to 1","MSK","Non-work related","Non-workers comp","Industry 4","Occupation 4","Health provider","Clinic appointment schedules","County B","Phone",1,1,null,0,"Ineligible reason1",0,null,0,null,0,null,"2019-08-20","2019-08-25","2019-09-08",null,null,{"$f":"IF(Table1[[#This Row],[First service received]]=1,\"Never dropped\",IF(Table1[[#This Row],[Enrolled]]=1,\"No first service\",IF(Table1[[#This Row],[Expressed interest]]=1,\"Not enrolled\",IF(Table1[[#This Row],[Eligible]]=1,\"Not interested\",IF(Table1[[#This Row],[Contacted]]=1,\"Not eligible\",IF(Table1[[#This Row],[Identified]]=1,\"Not contacted\",\"\"))))))","v":"Not eligible"},{"$f":"_xlfn.CONCAT(Table1[[#This Row],[Reason not contacted]],Table1[[#This Row],[Reason not eligible]],Table1[[#This Row],[Reason not interested]],Table1[[#This Row],[Reason not enrolled]],Table1[[#This Row],[Reason first service not received]])","v":"Ineligible reason1"}]
[1163,null,"25 to 44 yrs","M","Non-Hispanic/Latino","White","Yes","Yes","No","Employed","2 to 6","MSK","Non-work related","Non-workers comp","Industry 2","Occupation 3","Health provider","Clinic appointment schedules","County B","Phone",1,1,null,1,null,0,"Impact on provider relationship",0,null,0,null,"2019-08-21","2019-09-03","2019-09-19",null,null,{"$f":"IF(Table1[[#This Row],[First service received]]=1,\"Never dropped\",IF(Table1[[#This Row],[Enrolled]]=1,\"No first service\",IF(Table1[[#This Row],[Expressed interest]]=1,\"Not enrolled\",IF(Table1[[#This Row],[Eligible]]=1,\"Not interested\",IF(Table1[[#This Row],[Contacted]]=1,\"Not eligible\",IF(Table1[[#This Row],[Identified]]=1,\"Not contacted\",\"\"))))))","v":"Not interested"},{"$f":"_xlfn.CONCAT(Table1[[#This Row],[Reason not contacted]],Table1[[#This Row],[Reason not eligible]],Table1[[#This Row],[Reason not interested]],Table1[[#This Row],[Reason not enrolled]],Table1[[#This Row],[Reason first service not received]])","v":"Impact on provider relationship"}]
[1500,null,"25 to 44 yrs","F","Non-Hispanic/Latino","White","Yes","Yes","No","Employed","7 to 12","Cardio or Respiratory","Non-work related","Non-workers comp","Industry 2","Occupation 3","Employer","Electronic Health Records","County C","Phone",1,1,null,0,"Ineligible reason2",0,null,0,null,0,null,"2019-08-21","2019-08-27","2019-09-09",null,null,{"$f":"IF(Table1[[#This Row],[First service received]]=1,\"Never dropped\",IF(Table1[[#This Row],[Enrolled]]=1,\"No first service\",IF(Table1[[#This Row],[Expressed interest]]=1,\"Not enrolled\",IF(Table1[[#This Row],[Eligible]]=1,\"Not interested\",IF(Table1[[#This Row],[Contacted]]=1,\"Not eligible\",IF(Table1[[#This Row],[Identified]]=1,\"Not contacted\",\"\"))))))","v":"Not eligible"},{"$f":"_xlfn.CONCAT(Table1[[#This Row],[Reason not contacted]],Table1[[#This Row],[Reason not eligible]],Table1[[#This Row],[Reason not interested]],Table1[[#This Row],[Reason not enrolled]],Table1[[#This Row],[Reason first service not received]])","v":"Ineligible reason2"}]
[1562,null,"65 yrs +","M","Non-Hispanic/Latino","Black or African-American","No","No","No","Employed","7 to 12","MSK","Non-work related","Non-workers comp","Industry 3","Occupation 2","Self","Electronic Health Records","County B","Phone",1,1,null,1,null,0,"Not interested reason3",0,null,0,null,"2019-08-21","2019-08-22","2019-09-18",null,null,{"$f":"IF(Table1[[#This Row],[First service received]]=1,\"Never dropped\",IF(Table1[[#This Row],[Enrolled]]=1,\"No first service\",IF(Table1[[#This Row],[Expressed interest]]=1,\"Not enrolled\",IF(Table1[[#This Row],[Eligible]]=1,\"Not interested\",IF(Table1[[#This Row],[Contacted]]=1,\"Not eligible\",IF(Table1[[#This Row],[Identified]]=1,\"Not contacted\",\"\"))))))","v":"Not interested"},{"$f":"_xlfn.CONCAT(Table1[[#This Row],[Reason not contacted]],Table1[[#This Row],[Reason not eligible]],Table1[[#This Row],[Reason not interested]],Table1[[#This Row],[Reason not enrolled]],Table1[[#This Row],[Reason first service not received]])","v":"Not interested reason3"}]
[1583,null,"18 to 24 yrs","M","Non-Hispanic/Latino","White","Yes","Yes","No","Employed","7 to 12","MSK","Non-work related","Non-workers comp","Industry 3","Occupation 2","Health provider","Clinic appointment schedules","County B","In person",1,1,null,1,null,0,"Impact on provider relationship",0,null,0,null,"2019-08-21","2019-08-26","2019-09-10",null,null,{"$f":"IF(Table1[[#This Row],[First service received]]=1,\"Never dropped\",IF(Table1[[#This Row],[Enrolled]]=1,\"No first service\",IF(Table1[[#This Row],[Expressed interest]]=1,\"Not enrolled\",IF(Table1[[#This Row],[Eligible]]=1,\"Not interested\",IF(Table1[[#This Row],[Contacted]]=1,\"Not eligible\",IF(Table1[[#This Row],[Identified]]=1,\"Not contacted\",\"\"))))))","v":"Not interested"},{"$f":"_xlfn.CONCAT(Table1[[#This Row],[Reason not contacted]],Table1[[#This Row],[Reason not eligible]],Table1[[#This Row],[Reason not interested]],Table1[[#This Row],[Reason not enrolled]],Table1[[#This Row],[Reason first service not received]])","v":"Impact on provider relationship"}]
[1221,null,"45 to 64 yrs","F","Hispanic/Latino","White","Yes","Yes","No","Employed","7 to 12","Cardio or Respiratory","Non-work related","Non-workers comp","Industry 3","Occupation 2","Health provider","Work restriction forms","County B","Phone",1,1,null,0,"Ineligible reason3",0,null,0,null,0,null,"2019-08-22","2019-09-03","2019-10-03",null,null,{"$f":"IF(Table1[[#This Row],[First service received]]=1,\"Never dropped\",IF(Table1[[#This Row],[Enrolled]]=1,\"No first service\",IF(Table1[[#This Row],[Expressed interest]]=1,\"Not enrolled\",IF(Table1[[#This Row],[Eligible]]=1,\"Not interested\",IF(Table1[[#This Row],[Contacted]]=1,\"Not eligible\",IF(Table1[[#This Row],[Identified]]=1,\"Not contacted\",\"\"))))))","v":"Not eligible"},{"$f":"_xlfn.CONCAT(Table1[[#This Row],[Reason not contacted]],Table1[[#This Row],[Reason not eligible]],Table1[[#This Row],[Reason not interested]],Table1[[#This Row],[Reason not enrolled]],Table1[[#This Row],[Reason first service not received]])","v":"Ineligible reason3"}]
[1294,null,"25 to 44 yrs","M","Non-Hispanic/Latino","White","Yes","Yes","No","Employed","7 to 12","Cardio or Respiratory","Non-work related","Non-workers comp","Industry 2","Occupation 3","Health provider","Worker’s comp database","County B","Email",1,1,null,1,null,1,null,1,null,0,"No show","2019-08-22","2019-09-01","2019-09-13","2019-09-15",null,{"$f":"IF(Table1[[#This Row],[First service received]]=1,\"Never dropped\",IF(Table1[[#This Row],[Enrolled]]=1,\"No first service\",IF(Table1[[#This Row],[Expressed interest]]=1,\"Not enrolled\",IF(Table1[[#This Row],[Eligible]]=1,\"Not interested\",IF(Table1[[#This Row],[Contacted]]=1,\"Not eligible\",IF(Table1[[#This Row],[Identified]]=1,\"Not contacted\",\"\"))))))","v":"No first service"},{"$f":"_xlfn.CONCAT(Table1[[#This Row],[Reason not contacted]],Table1[[#This Row],[Reason not eligible]],Table1[[#This Row],[Reason not interested]],Table1[[#This Row],[Reason not enrolled]],Table1[[#This Row],[Reason first service not received]])","v":"No show"}]
[1508,null,"45 to 64 yrs","F","Non-Hispanic/Latino","White","Yes","Yes","No","Employed","0 to 1","MSK","Non-work related","Non-workers comp","Industry 3","Occupation 4","Health provider","Clinic appointment schedules","County B","Email",1,1,null,1,null,0,"Impact on provider relationship",0,null,0,null,"2019-08-22","2019-09-04","2019-10-15",null,null,{"$f":"IF(Table1[[#This Row],[First service received]]=1,\"Never dropped\",IF(Table1[[#This Row],[Enrolled]]=1,\"No first service\",IF(Table1[[#This Row],[Expressed interest]]=1,\"Not enrolled\",IF(Table1[[#This Row],[Eligible]]=1,\"Not interested\",IF(Table1[[#This Row],[Contacted]]=1,\"Not eligible\",IF(Table1[[#This Row],[Identified]]=1,\"Not contacted\",\"\"))))))","v":"Not interested"},{"$f":"_xlfn.CONCAT(Table1[[#This Row],[Reason not contacted]],Table1[[#This Row],[Reason not eligible]],Table1[[#This Row],[Reason not interested]],Table1[[#This Row],[Reason not enrolled]],Table1[[#This Row],[Reason first service not received]])","v":"Impact on provider relationship"}]
[1110,null,"18 to 24 yrs","F","Non-Hispanic/Latino","White","Yes","Yes","No","Self-employed","13+ weeks","Cardio or Respiratory","Non-work related","Non-workers comp","Industry 3","Occupation 2","Workforce partner","Electronic Health Records","County B","In person",1,1,null,1,null,1,null,1,null,1,null,"2019-08-23","2019-08-30","2019-09-10","2019-09-16","2019-09-21",{"$f":"IF(Table1[[#This Row],[First service received]]=1,\"Never dropped\",IF(Table1[[#This Row],[Enrolled]]=1,\"No first service\",IF(Table1[[#This Row],[Expressed interest]]=1,\"Not enrolled\",IF(Table1[[#This Row],[Eligible]]=1,\"Not interested\",IF(Table1[[#This Row],[Contacted]]=1,\"Not eligible\",IF(Table1[[#This Row],[Identified]]=1,\"Not contacted\",\"\"))))))","v":"Never dropped"},{"$f":"_xlfn.CONCAT(Table1[[#This Row],[Reason not contacted]],Table1[[#This Row],[Reason not eligible]],Table1[[#This Row],[Reason not interested]],Table1[[#This Row],[Reason not enrolled]],Table1[[#This Row],[Reason first service not received]])","v":""}]
[1157,null,"25 to 44 yrs","F","Non-Hispanic/Latino","Black or African-American","Yes","Yes","No","Employed","2 to 6","Cardio or Respiratory","Non-work related","Non-workers comp","Industry 3","Occupation 2","Health provider","Clinic appointment schedules","County A","Phone",1,1,null,1,null,0,"Not interested reason3",0,null,0,null,"2019-08-23","2019-09-04","2019-10-02",null,null,{"$f":"IF(Table1[[#This Row],[First service received]]=1,\"Never dropped\",IF(Table1[[#This Row],[Enrolled]]=1,\"No first service\",IF(Table1[[#This Row],[Expressed interest]]=1,\"Not enrolled\",IF(Table1[[#This Row],[Eligible]]=1,\"Not interested\",IF(Table1[[#This Row],[Contacted]]=1,\"Not eligible\",IF(Table1[[#This Row],[Identified]]=1,\"Not contacted\",\"\"))))))","v":"Not interested"},{"$f":"_xlfn.CONCAT(Table1[[#This Row],[Reason not contacted]],Table1[[#This Row],[Reason not eligible]],Table1[[#This Row],[Reason not interested]],Table1[[#This Row],[Reason not enrolled]],Table1[[#This Row],[Reason first service not received]])","v":"Not interested reason3"}]
[1161,null,"45 to 64 yrs","F","Non-Hispanic/Latino","White","No","Yes","No","Not Employed","0 to 1","MSK","Non-work related","Non-workers comp","Industry 1","Occupation 3","Health provider","Work restriction forms","County B","Phone",1,1,null,1,null,0,"Not interested reason3",0,null,0,null,"2019-08-23","2019-09-02","2019-09-15",null,null,{"$f":"IF(Table1[[#This Row],[First service received]]=1,\"Never dropped\",IF(Table1[[#This Row],[Enrolled]]=1,\"No first service\",IF(Table1[[#This Row],[Expressed interest]]=1,\"Not enrolled\",IF(Table1[[#This Row],[Eligible]]=1,\"Not interested\",IF(Table1[[#This Row],[Contacted]]=1,\"Not eligible\",IF(Table1[[#This Row],[Identified]]=1,\"Not contacted\",\"\"))))))","v":"Not interested"},{"$f":"_xlfn.CONCAT(Table1[[#This Row],[Reason not contacted]],Table1[[#This Row],[Reason not eligible]],Table1[[#This Row],[Reason not interested]],Table1[[#This Row],[Reason not enrolled]],Table1[[#This Row],[Reason first service not received]])","v":"Not interested reason3"}]
[1411,null,"18 to 24 yrs","M","Non-Hispanic/Latino","White","Yes","Yes","No","Employed","2 to 6","MSK","Non-work related","Non-workers comp","Industry 1","Occupation 3","Employer","Electronic Health Records","County B","Email",1,1,null,1,null,0,"Don't want to be in research study",0,null,0,null,"2019-08-23","2019-09-02","2019-09-02",null,null,{"$f":"IF(Table1[[#This Row],[First service received]]=1,\"Never dropped\",IF(Table1[[#This Row],[Enrolled]]=1,\"No first service\",IF(Table1[[#This Row],[Expressed interest]]=1,\"Not enrolled\",IF(Table1[[#This Row],[Eligible]]=1,\"Not interested\",IF(Table1[[#This Row],[Contacted]]=1,\"Not eligible\",IF(Table1[[#This Row],[Identified]]=1,\"Not contacted\",\"\"))))))","v":"Not interested"},{"$f":"_xlfn.CONCAT(Table1[[#This Row],[Reason not contacted]],Table1[[#This Row],[Reason not eligible]],Table1[[#This Row],[Reason not interested]],Table1[[#This Row],[Reason not enrolled]],Table1[[#This Row],[Reason first service not received]])","v":"Don't want to be in research study"}]
[1456,null,"45 to 64 yrs","F","Non-Hispanic/Latino","Black or African-American","Yes","Yes","No","Employed","2 to 6","MSK","Non-work related","Non-workers comp","Industry 3","Occupation 2","Health provider","Work restriction forms","County B","Phone",1,1,null,0,"Ineligible reason3",0,null,0,null,0,null,"2019-08-23","2019-08-24","2019-09-17",null,null,{"$f":"IF(Table1[[#This Row],[First service received]]=1,\"Never dropped\",IF(Table1[[#This Row],[Enrolled]]=1,\"No first service\",IF(Table1[[#This Row],[Expressed interest]]=1,\"Not enrolled\",IF(Table1[[#This Row],[Eligible]]=1,\"Not interested\",IF(Table1[[#This Row],[Contacted]]=1,\"Not eligible\",IF(Table1[[#This Row],[Identified]]=1,\"Not contacted\",\"\"))))))","v":"Not eligible"},{"$f":"_xlfn.CONCAT(Table1[[#This Row],[Reason not contacted]],Table1[[#This Row],[Reason not eligible]],Table1[[#This Row],[Reason not interested]],Table1[[#This Row],[Reason not enrolled]],Table1[[#This Row],[Reason first service not received]])","v":"Ineligible reason3"}]
[1028,"lorem ipsum","25 to 44 yrs","M","Non-Hispanic/Latino","Black or African-American","Yes","Yes","No","Employed","7 to 12","MSK","Non-work related","Non-workers comp","Industry 3","Occupation 2","Health provider","Work restriction forms","County B","Phone",1,1,null,1,null,0,"Impact on provider relationship",0,null,0,null,"2019-08-24","2019-09-04","2019-09-29",null,null,{"$f":"IF(Table1[[#This Row],[First service received]]=1,\"Never dropped\",IF(Table1[[#This Row],[Enrolled]]=1,\"No first service\",IF(Table1[[#This Row],[Expressed interest]]=1,\"Not enrolled\",IF(Table1[[#This Row],[Eligible]]=1,\"Not interested\",IF(Table1[[#This Row],[Contacted]]=1,\"Not eligible\",IF(Table1[[#This Row],[Identified]]=1,\"Not contacted\",\"\"))))))","v":"Not interested"},{"$f":"_xlfn.CONCAT(Table1[[#This Row],[Reason not contacted]],Table1[[#This Row],[Reason not eligible]],Table1[[#This Row],[Reason not interested]],Table1[[#This Row],[Reason not enrolled]],Table1[[#This Row],[Reason first service not received]])","v":"Impact on provider relationship"}]
[1239,null,"25 to 44 yrs","M","Non-Hispanic/Latino","White","Yes","Yes","No","Not Employed","0 to 1","Other","Work related","Non-workers comp","Industry 3","Occupation 1","Health provider","Worker’s comp database","County B","Email",1,1,null,0,"Ineligible reason1",0,null,0,null,0,null,"2019-08-24","2019-09-05","2019-10-06",null,null,{"$f":"IF(Table1[[#This Row],[First service received]]=1,\"Never dropped\",IF(Table1[[#This Row],[Enrolled]]=1,\"No first service\",IF(Table1[[#This Row],[Expressed interest]]=1,\"Not enrolled\",IF(Table1[[#This Row],[Eligible]]=1,\"Not interested\",IF(Table1[[#This Row],[Contacted]]=1,\"Not eligible\",IF(Table1[[#This Row],[Identified]]=1,\"Not contacted\",\"\"))))))","v":"Not eligible"},{"$f":"_xlfn.CONCAT(Table1[[#This Row],[Reason not contacted]],Table1[[#This Row],[Reason not eligible]],Table1[[#This Row],[Reason not interested]],Table1[[#This Row],[Reason not enrolled]],Table1[[#This Row],[Reason first service not received]])","v":"Ineligible reason1"}]
[1273,null,"25 to 44 yrs","M","Non-Hispanic/Latino","White","Yes","Yes","No","Employed","7 to 12","MSK","Work related","Workers comp","Industry 3","Occupation 2","Health provider","Worker’s comp database","County B","In person",1,0,"Contacted, no response",0,null,0,null,0,null,0,null,"2019-08-24",null,null,null,null,{"$f":"IF(Table1[[#This Row],[First service received]]=1,\"Never dropped\",IF(Table1[[#This Row],[Enrolled]]=1,\"No first service\",IF(Table1[[#This Row],[Expressed interest]]=1,\"Not enrolled\",IF(Table1[[#This Row],[Eligible]]=1,\"Not interested\",IF(Table1[[#This Row],[Contacted]]=1,\"Not eligible\",IF(Table1[[#This Row],[Identified]]=1,\"Not contacted\",\"\"))))))","v":"Not contacted"},{"$f":"_xlfn.CONCAT(Table1[[#This Row],[Reason not contacted]],Table1[[#This Row],[Reason not eligible]],Table1[[#This Row],[Reason not interested]],Table1[[#This Row],[Reason not enrolled]],Table1[[#This Row],[Reason first service not received]])","v":"Contacted, no response"}]
[1323,null,"25 to 44 yrs","F","Non-Hispanic/Latino","American Indian or Alaska Native","Yes","Yes","No","Employed","0 to 1","Cardio or Respiratory","Work related","Non-workers comp","Industry 4","Occupation 3","Health provider","Voc rehab centers","County B","Email",1,1,null,1,null,1,null,1,null,1,null,"2019-08-24","2019-09-05","2019-09-14","2019-10-02","2019-10-03",{"$f":"IF(Table1[[#This Row],[First service received]]=1,\"Never dropped\",IF(Table1[[#This Row],[Enrolled]]=1,\"No first service\",IF(Table1[[#This Row],[Expressed interest]]=1,\"Not enrolled\",IF(Table1[[#This Row],[Eligible]]=1,\"Not interested\",IF(Table1[[#This Row],[Contacted]]=1,\"Not eligible\",IF(Table1[[#This Row],[Identified]]=1,\"Not contacted\",\"\"))))))","v":"Never dropped"},{"$f":"_xlfn.CONCAT(Table1[[#This Row],[Reason not contacted]],Table1[[#This Row],[Reason not eligible]],Table1[[#This Row],[Reason not interested]],Table1[[#This Row],[Reason not enrolled]],Table1[[#This Row],[Reason first service not received]])","v":""}]
[1418,null,"45 to 64 yrs","M","Non-Hispanic/Latino","White","No","Yes","No","Not Employed","0 to 1","MSK","Work related","Non-workers comp","Industry 3","Occupation 2","Health provider","Voc rehab centers","County B","Phone",1,1,null,0,"Ineligible reason2",0,null,0,null,0,null,"2019-08-24","2019-08-27","2019-10-09",null,null,{"$f":"IF(Table1[[#This Row],[First service received]]=1,\"Never dropped\",IF(Table1[[#This Row],[Enrolled]]=1,\"No first service\",IF(Table1[[#This Row],[Expressed interest]]=1,\"Not enrolled\",IF(Table1[[#This Row],[Eligible]]=1,\"Not interested\",IF(Table1[[#This Row],[Contacted]]=1,\"Not eligible\",IF(Table1[[#This Row],[Identified]]=1,\"Not contacted\",\"\"))))))","v":"Not eligible"},{"$f":"_xlfn.CONCAT(Table1[[#This Row],[Reason not contacted]],Table1[[#This Row],[Reason not eligible]],Table1[[#This Row],[Reason not interested]],Table1[[#This Row],[Reason not enrolled]],Table1[[#This Row],[Reason first service not received]])","v":"Ineligible reason2"}]
[1536,null,"25 to 44 yrs","M","Non-Hispanic/Latino","American Indian or Alaska Native","Yes","Yes","No","Employed","0 to 1","MSK","Work related","Non-workers comp","Industry 4","Occupation 3","Health provider","FMLA forms","County B","Phone",1,1,null,0,"Ineligible reason1",0,null,0,null,0,null,"2019-08-24","2019-09-05","2019-10-11",null,null,{"$f":"IF(Table1[[#This Row],[First service received]]=1,\"Never dropped\",IF(Table1[[#This Row],[Enrolled]]=1,\"No first service\",IF(Table1[[#This Row],[Expressed interest]]=1,\"Not enrolled\",IF(Table1[[#This Row],[Eligible]]=1,\"Not interested\",IF(Table1[[#This Row],[Contacted]]=1,\"Not eligible\",IF(Table1[[#This Row],[Identified]]=1,\"Not contacted\",\"\"))))))","v":"Not eligible"},{"$f":"_xlfn.CONCAT(Table1[[#This Row],[Reason not contacted]],Table1[[#This Row],[Reason not eligible]],Table1[[#This Row],[Reason not interested]],Table1[[#This Row],[Reason not enrolled]],Table1[[#This Row],[Reason first service not received]])","v":"Ineligible reason1"}]
[1582,null,"25 to 44 yrs","M","Non-Hispanic/Latino","White","No","Yes","No","Not Employed","0 to 1","MSK","Work related","Non-workers comp","Industry 1","Occupation 3","Self","Electronic Health Records","County B","Phone",1,1,null,1,null,0,"Impact on provider relationship",0,null,0,null,"2019-08-24","2019-08-26","2019-10-10",null,null,{"$f":"IF(Table1[[#This Row],[First service received]]=1,\"Never dropped\",IF(Table1[[#This Row],[Enrolled]]=1,\"No first service\",IF(Table1[[#This Row],[Expressed interest]]=1,\"Not enrolled\",IF(Table1[[#This Row],[Eligible]]=1,\"Not interested\",IF(Table1[[#This Row],[Contacted]]=1,\"Not eligible\",IF(Table1[[#This Row],[Identified]]=1,\"Not contacted\",\"\"))))))","v":"Not interested"},{"$f":"_xlfn.CONCAT(Table1[[#This Row],[Reason not contacted]],Table1[[#This Row],[Reason not eligible]],Table1[[#This Row],[Reason not interested]],Table1[[#This Row],[Reason not enrolled]],Table1[[#This Row],[Reason first service not received]])","v":"Impact on provider relationship"}]
[1600,null,"45 to 64 yrs","M","Hispanic/Latino","White","Yes","Yes","No","Employed","2 to 6","MSK","Non-work related","Non-workers comp","Industry 4","Occupation 3","Employer","Electronic Health Records","County B","Other",1,0,"Inaccurate contact info",0,null,0,null,0,null,0,null,"2019-08-24",null,null,null,null,{"$f":"IF(Table1[[#This Row],[First service received]]=1,\"Never dropped\",IF(Table1[[#This Row],[Enrolled]]=1,\"No first service\",IF(Table1[[#This Row],[Expressed interest]]=1,\"Not enrolled\",IF(Table1[[#This Row],[Eligible]]=1,\"Not interested\",IF(Table1[[#This Row],[Contacted]]=1,\"Not eligible\",IF(Table1[[#This Row],[Identified]]=1,\"Not contacted\",\"\"))))))","v":"Not contacted"},{"$f":"_xlfn.CONCAT(Table1[[#This Row],[Reason not contacted]],Table1[[#This Row],[Reason not eligible]],Table1[[#This Row],[Reason not interested]],Table1[[#This Row],[Reason not enrolled]],Table1[[#This Row],[Reason first service not received]])","v":"Inaccurate contact info"}]
[1181,null,"45 to 64 yrs","M","Non-Hispanic/Latino","White","Yes","Yes","No","Employed","2 to 6","MSK","Non-work related","Non-workers comp","Industry 1","Occupation 4","Health provider","FMLA forms","County B","Other",1,0,"Inaccurate contact info",0,null,0,null,0,null,0,null,"2019-08-25",null,null,null,null,{"$f":"IF(Table1[[#This Row],[First service received]]=1,\"Never dropped\",IF(Table1[[#This Row],[Enrolled]]=1,\"No first service\",IF(Table1[[#This Row],[Expressed interest]]=1,\"Not enrolled\",IF(Table1[[#This Row],[Eligible]]=1,\"Not interested\",IF(Table1[[#This Row],[Contacted]]=1,\"Not eligible\",IF(Table1[[#This Row],[Identified]]=1,\"Not contacted\",\"\"))))))","v":"Not contacted"},{"$f":"_xlfn.CONCAT(Table1[[#This Row],[Reason not contacted]],Table1[[#This Row],[Reason not eligible]],Table1[[#This Row],[Reason not interested]],Table1[[#This Row],[Reason not enrolled]],Table1[[#This Row],[Reason first service not received]])","v":"Inaccurate contact info"}]
[1187,null,"18 to 24 yrs","F","Non-Hispanic/Latino","Black or African-American","Yes","Yes","No","Employed","7 to 12","MSK","Non-work related","Non-workers comp","Industry 3","Occupation 2","Health provider","Worker’s comp database","County B","In person",1,1,null,1,null,1,null,1,null,1,null,"2019-08-25","2019-08-30","2019-09-08","2019-09-20","2019-09-23",{"$f":"IF(Table1[[#This Row],[First service received]]=1,\"Never dropped\",IF(Table1[[#This Row],[Enrolled]]=1,\"No first service\",IF(Table1[[#This Row],[Expressed interest]]=1,\"Not enrolled\",IF(Table1[[#This Row],[Eligible]]=1,\"Not interested\",IF(Table1[[#This Row],[Contacted]]=1,\"Not eligible\",IF(Table1[[#This Row],[Identified]]=1,\"Not contacted\",\"\"))))))","v":"Never dropped"},{"$f":"_xlfn.CONCAT(Table1[[#This Row],[Reason not contacted]],Table1[[#This Row],[Reason not eligible]],Table1[[#This Row],[Reason not interested]],Table1[[#This Row],[Reason not enrolled]],Table1[[#This Row],[Reason first service not received]])","v":""}]
[1233,null,"45 to 64 yrs","M","Hispanic/Latino","White","Yes","Yes","No","Not Employed","0 to 1","MSK","Non-work related","Non-workers comp","Industry 3","Occupation 2","Employer","Electronic Health Records","County B","Email",1,0,"Contacted, no response",0,null,0,null,0,null,0,null,"2019-08-25",null,null,null,null,{"$f":"IF(Table1[[#This Row],[First service received]]=1,\"Never dropped\",IF(Table1[[#This Row],[Enrolled]]=1,\"No first service\",IF(Table1[[#This Row],[Expressed interest]]=1,\"Not enrolled\",IF(Table1[[#This Row],[Eligible]]=1,\"Not interested\",IF(Table1[[#This Row],[Contacted]]=1,\"Not eligible\",IF(Table1[[#This Row],[Identified]]=1,\"Not contacted\",\"\"))))))","v":"Not contacted"},{"$f":"_xlfn.CONCAT(Table1[[#This Row],[Reason not contacted]],Table1[[#This Row],[Reason not eligible]],Table1[[#This Row],[Reason not interested]],Table1[[#This Row],[Reason not enrolled]],Table1[[#This Row],[Reason first service not received]])","v":"Contacted, no response"}]
[1311,null,"25 to 44 yrs","F","Non-Hispanic/Latino","White","Yes","Yes","No","Employed","2 to 6","MSK","Non-work related","Non-workers comp","Industry 3","Occupation 3","Employer","Electronic Health Records","County B","Phone",1,1,null,0,"Ineligible reason2",0,null,0,null,0,null,"2019-08-25","2019-08-30","2019-08-31",null,null,{"$f":"IF(Table1[[#This Row],[First service received]]=1,\"Never dropped\",IF(Table1[[#This Row],[Enrolled]]=1,\"No first service\",IF(Table1[[#This Row],[Expressed interest]]=1,\"Not enrolled\",IF(Table1[[#This Row],[Eligible]]=1,\"Not interested\",IF(Table1[[#This Row],[Contacted]]=1,\"Not eligible\",IF(Table1[[#This Row],[Identified]]=1,\"Not contacted\",\"\"))))))","v":"Not eligible"},{"$f":"_xlfn.CONCAT(Table1[[#This Row],[Reason not contacted]],Table1[[#This Row],[Reason not eligible]],Table1[[#This Row],[Reason not interested]],Table1[[#This Row],[Reason not enrolled]],Table1[[#This Row],[Reason first service not received]])","v":"Ineligible reason2"}]
[1359,null,"45 to 64 yrs","M","Non-Hispanic/Latino","White","Yes","Yes","No","Employed","7 to 12","MSK","Non-work related","Non-workers comp","Industry 3","Occupation 2","Health provider","Worker’s comp database","County B","Phone",1,1,null,1,null,0,"Impact on provider relationship",0,null,0,null,"2019-08-25","2019-09-07","2019-09-17",null,null,{"$f":"IF(Table1[[#This Row],[First service received]]=1,\"Never dropped\",IF(Table1[[#This Row],[Enrolled]]=1,\"No first service\",IF(Table1[[#This Row],[Expressed interest]]=1,\"Not enrolled\",IF(Table1[[#This Row],[Eligible]]=1,\"Not interested\",IF(Table1[[#This Row],[Contacted]]=1,\"Not eligible\",IF(Table1[[#This Row],[Identified]]=1,\"Not contacted\",\"\"))))))","v":"Not interested"},{"$f":"_xlfn.CONCAT(Table1[[#This Row],[Reason not contacted]],Table1[[#This Row],[Reason not eligible]],Table1[[#This Row],[Reason not interested]],Table1[[#This Row],[Reason not enrolled]],Table1[[#This Row],[Reason first service not received]])","v":"Impact on provider relationship"}]
[1543,null,"25 to 44 yrs","F","Hispanic/Latino","White","No","Yes","No","Employed","7 to 12","MSK","Work related","Non-workers comp","Industry 3","Occupation 2","Health provider","Voc rehab centers","County C","Email",1,1,null,1,null,1,null,0,"Circumstances changed",0,null,"2019-08-25","2019-08-29","2019-10-05",null,null,{"$f":"IF(Table1[[#This Row],[First service received]]=1,\"Never dropped\",IF(Table1[[#This Row],[Enrolled]]=1,\"No first service\",IF(Table1[[#This Row],[Expressed interest]]=1,\"Not enrolled\",IF(Table1[[#This Row],[Eligible]]=1,\"Not interested\",IF(Table1[[#This Row],[Contacted]]=1,\"Not eligible\",IF(Table1[[#This Row],[Identified]]=1,\"Not contacted\",\"\"))))))","v":"Not enrolled"},{"$f":"_xlfn.CONCAT(Table1[[#This Row],[Reason not contacted]],Table1[[#This Row],[Reason not eligible]],Table1[[#This Row],[Reason not interested]],Table1[[#This Row],[Reason not enrolled]],Table1[[#This Row],[Reason first service not received]])","v":"Circumstances changed"}]
[1605,null,"65 yrs +","M","Non-Hispanic/Latino","American Indian or Alaska Native","Yes","Yes","No","Employed","2 to 6","MSK","Non-work related","Non-workers comp","Industry 1","Occupation 4","Health provider","FMLA forms","County A","In person",1,1,null,1,null,1,null,0,"Circumstances changed",0,null,"2019-08-25","2019-08-31","2019-09-28",null,null,{"$f":"IF(Table1[[#This Row],[First service received]]=1,\"Never dropped\",IF(Table1[[#This Row],[Enrolled]]=1,\"No first service\",IF(Table1[[#This Row],[Expressed interest]]=1,\"Not enrolled\",IF(Table1[[#This Row],[Eligible]]=1,\"Not interested\",IF(Table1[[#This Row],[Contacted]]=1,\"Not eligible\",IF(Table1[[#This Row],[Identified]]=1,\"Not contacted\",\"\"))))))","v":"Not enrolled"},{"$f":"_xlfn.CONCAT(Table1[[#This Row],[Reason not contacted]],Table1[[#This Row],[Reason not eligible]],Table1[[#This Row],[Reason not interested]],Table1[[#This Row],[Reason not enrolled]],Table1[[#This Row],[Reason first service not received]])","v":"Circumstances changed"}]
[1065,null,"25 to 44 yrs","M","Non-Hispanic/Latino","White","Yes","Yes","No","Employed","13+ weeks","MSK","Non-work related","Non-workers comp","Industry 2","Occupation 3","Health provider","Clinic appointment schedules","County B","Email",1,1,null,1,null,0,"Impact on provider relationship",0,null,0,null,"2019-08-26","2019-09-05","2019-09-23",null,null,{"$f":"IF(Table1[[#This Row],[First service received]]=1,\"Never dropped\",IF(Table1[[#This Row],[Enrolled]]=1,\"No first service\",IF(Table1[[#This Row],[Expressed interest]]=1,\"Not enrolled\",IF(Table1[[#This Row],[Eligible]]=1,\"Not interested\",IF(Table1[[#This Row],[Contacted]]=1,\"Not eligible\",IF(Table1[[#This Row],[Identified]]=1,\"Not contacted\",\"\"))))))","v":"Not interested"},{"$f":"_xlfn.CONCAT(Table1[[#This Row],[Reason not contacted]],Table1[[#This Row],[Reason not eligible]],Table1[[#This Row],[Reason not interested]],Table1[[#This Row],[Reason not enrolled]],Table1[[#This Row],[Reason first service not received]])","v":"Impact on provider relationship"}]
[1109,null,"45 to 64 yrs","F","Non-Hispanic/Latino","White","Yes","Yes","No","Employed","13+ weeks","Other","Work related","Workers comp","Industry 3","Occupation 2","Health provider","Work restriction forms","County B","Phone",1,1,null,0,"Ineligible reason3",0,null,0,null,0,null,"2019-08-26","2019-09-08","2019-09-16",null,null,{"$f":"IF(Table1[[#This Row],[First service received]]=1,\"Never dropped\",IF(Table1[[#This Row],[Enrolled]]=1,\"No first service\",IF(Table1[[#This Row],[Expressed interest]]=1,\"Not enrolled\",IF(Table1[[#This Row],[Eligible]]=1,\"Not interested\",IF(Table1[[#This Row],[Contacted]]=1,\"Not eligible\",IF(Table1[[#This Row],[Identified]]=1,\"Not contacted\",\"\"))))))","v":"Not eligible"},{"$f":"_xlfn.CONCAT(Table1[[#This Row],[Reason not contacted]],Table1[[#This Row],[Reason not eligible]],Table1[[#This Row],[Reason not interested]],Table1[[#This Row],[Reason not enrolled]],Table1[[#This Row],[Reason first service not received]])","v":"Ineligible reason3"}]
[1081,null,"25 to 44 yrs","M","Non-Hispanic/Latino","Black or African-American","Yes","Yes","No","Employed","7 to 12","Other","Non-work related","Non-workers comp","Industry 1","Occupation 1","Employer","Electronic Health Records","County B","Phone",1,1,null,1,null,1,null,1,null,1,null,"2019-08-27","2019-08-31","2019-09-08","2019-09-30","2019-10-01",{"$f":"IF(Table1[[#This Row],[First service received]]=1,\"Never dropped\",IF(Table1[[#This Row],[Enrolled]]=1,\"No first service\",IF(Table1[[#This Row],[Expressed interest]]=1,\"Not enrolled\",IF(Table1[[#This Row],[Eligible]]=1,\"Not interested\",IF(Table1[[#This Row],[Contacted]]=1,\"Not eligible\",IF(Table1[[#This Row],[Identified]]=1,\"Not contacted\",\"\"))))))","v":"Never dropped"},{"$f":"_xlfn.CONCAT(Table1[[#This Row],[Reason not contacted]],Table1[[#This Row],[Reason not eligible]],Table1[[#This Row],[Reason not interested]],Table1[[#This Row],[Reason not enrolled]],Table1[[#This Row],[Reason first service not received]])","v":""}]
[1136,null,"45 to 64 yrs","F","Non-Hispanic/Latino","White","Yes","Yes","No","Employed","0 to 1","Cardio or Respiratory","Work related","Workers comp","Industry 3","Occupation 3","Employer","Electronic Health Records","County B","Phone",1,1,null,1,null,0,"Don't want to be in research study",0,null,0,null,"2019-08-27","2019-09-04","2019-10-08",null,null,{"$f":"IF(Table1[[#This Row],[First service received]]=1,\"Never dropped\",IF(Table1[[#This Row],[Enrolled]]=1,\"No first service\",IF(Table1[[#This Row],[Expressed interest]]=1,\"Not enrolled\",IF(Table1[[#This Row],[Eligible]]=1,\"Not interested\",IF(Table1[[#This Row],[Contacted]]=1,\"Not eligible\",IF(Table1[[#This Row],[Identified]]=1,\"Not contacted\",\"\"))))))","v":"Not interested"},{"$f":"_xlfn.CONCAT(Table1[[#This Row],[Reason not contacted]],Table1[[#This Row],[Reason not eligible]],Table1[[#This Row],[Reason not interested]],Table1[[#This Row],[Reason not enrolled]],Table1[[#This Row],[Reason first service not received]])","v":"Don't want to be in research study"}]
[1206,null,"25 to 44 yrs","M","Hispanic/Latino","White","Yes","Yes","No","Employed","7 to 12","Other","Work related","Non-workers comp","Industry 1","Occupation 1","Workforce partner","Electronic Health Records","County C","In person",1,1,null,1,null,1,null,1,null,1,null,"2019-08-27","2019-08-31","2019-09-02","2019-09-16","2019-09-24",{"$f":"IF(Table1[[#This Row],[First service received]]=1,\"Never dropped\",IF(Table1[[#This Row],[Enrolled]]=1,\"No first service\",IF(Table1[[#This Row],[Expressed interest]]=1,\"Not enrolled\",IF(Table1[[#This Row],[Eligible]]=1,\"Not interested\",IF(Table1[[#This Row],[Contacted]]=1,\"Not eligible\",IF(Table1[[#This Row],[Identified]]=1,\"Not contacted\",\"\"))))))","v":"Never dropped"},{"$f":"_xlfn.CONCAT(Table1[[#This Row],[Reason not contacted]],Table1[[#This Row],[Reason not eligible]],Table1[[#This Row],[Reason not interested]],Table1[[#This Row],[Reason not enrolled]],Table1[[#This Row],[Reason first service not received]])","v":""}]
[1269,null,"25 to 44 yrs","F","Hispanic/Latino","White","No","Yes","No","Employed","13+ weeks","MSK","Work related","Non-workers comp","Industry 3","Occupation 2","Health provider","Worker’s comp database","County B","Email",1,1,null,1,null,1,null,1,null,1,null,"2019-08-27","2019-09-01","2019-09-01","2019-09-29","2019-10-05",{"$f":"IF(Table1[[#This Row],[First service received]]=1,\"Never dropped\",IF(Table1[[#This Row],[Enrolled]]=1,\"No first service\",IF(Table1[[#This Row],[Expressed interest]]=1,\"Not enrolled\",IF(Table1[[#This Row],[Eligible]]=1,\"Not interested\",IF(Table1[[#This Row],[Contacted]]=1,\"Not eligible\",IF(Table1[[#This Row],[Identified]]=1,\"Not contacted\",\"\"))))))","v":"Never dropped"},{"$f":"_xlfn.CONCAT(Table1[[#This Row],[Reason not contacted]],Table1[[#This Row],[Reason not eligible]],Table1[[#This Row],[Reason not interested]],Table1[[#This Row],[Reason not enrolled]],Table1[[#This Row],[Reason first service not received]])","v":""}]
[1293,null,"45 to 64 yrs","F","Hispanic/Latino","White","Yes","Yes","No","Employed","7 to 12","Other","Non-work related","Non-workers comp","Industry 3","Occupation 2","Health provider","Worker’s comp database","County B","Phone",1,1,null,1,null,1,null,1,null,1,null,"2019-08-27","2019-09-07","2019-09-18","2019-10-02","2019-10-16",{"$f":"IF(Table1[[#This Row],[First service received]]=1,\"Never dropped\",IF(Table1[[#This Row],[Enrolled]]=1,\"No first service\",IF(Table1[[#This Row],[Expressed interest]]=1,\"Not enrolled\",IF(Table1[[#This Row],[Eligible]]=1,\"Not interested\",IF(Table1[[#This Row],[Contacted]]=1,\"Not eligible\",IF(Table1[[#This Row],[Identified]]=1,\"Not contacted\",\"\"))))))","v":"Never dropped"},{"$f":"_xlfn.CONCAT(Table1[[#This Row],[Reason not contacted]],Table1[[#This Row],[Reason not eligible]],Table1[[#This Row],[Reason not interested]],Table1[[#This Row],[Reason not enrolled]],Table1[[#This Row],[Reason first service not received]])","v":""}]
[1341,null,"25 to 44 yrs","F","Non-Hispanic/Latino","White","Yes","Yes","No","Employed","2 to 6","Other","Work related","Workers comp","Industry 1","Occupation 3","Health provider","Worker’s comp database","County B","Email",1,0,"Contacted, no response",0,null,0,null,0,null,0,null,"2019-08-27",null,null,null,null,{"$f":"IF(Table1[[#This Row],[First service received]]=1,\"Never dropped\",IF(Table1[[#This Row],[Enrolled]]=1,\"No first service\",IF(Table1[[#This Row],[Expressed interest]]=1,\"Not enrolled\",IF(Table1[[#This Row],[Eligible]]=1,\"Not interested\",IF(Table1[[#This Row],[Contacted]]=1,\"Not eligible\",IF(Table1[[#This Row],[Identified]]=1,\"Not contacted\",\"\"))))))","v":"Not contacted"},{"$f":"_xlfn.CONCAT(Table1[[#This Row],[Reason not contacted]],Table1[[#This Row],[Reason not eligible]],Table1[[#This Row],[Reason not interested]],Table1[[#This Row],[Reason not enrolled]],Table1[[#This Row],[Reason first service not received]])","v":"Contacted, no response"}]
[1390,null,"45 to 64 yrs","M","Non-Hispanic/Latino","White","Yes","Yes","No","Employed","2 to 6","MSK","Non-work related","Non-workers comp","Industry 1","Occupation 4","Health provider","Clinic appointment schedules","County A","Email",1,1,null,1,null,1,null,1,null,1,null,"2019-08-27","2019-08-29","2019-09-10","2019-09-21","2019-10-01",{"$f":"IF(Table1[[#This Row],[First service received]]=1,\"Never dropped\",IF(Table1[[#This Row],[Enrolled]]=1,\"No first service\",IF(Table1[[#This Row],[Expressed interest]]=1,\"Not enrolled\",IF(Table1[[#This Row],[Eligible]]=1,\"Not interested\",IF(Table1[[#This Row],[Contacted]]=1,\"Not eligible\",IF(Table1[[#This Row],[Identified]]=1,\"Not contacted\",\"\"))))))","v":"Never dropped"},{"$f":"_xlfn.CONCAT(Table1[[#This Row],[Reason not contacted]],Table1[[#This Row],[Reason not eligible]],Table1[[#This Row],[Reason not interested]],Table1[[#This Row],[Reason not enrolled]],Table1[[#This Row],[Reason first service not received]])","v":""}]
[1438,null,"25 to 44 yrs","F","Non-Hispanic/Latino","Black or African-American","Yes","Yes","No","Employed","0 to 1","MSK","Non-work related","Non-workers comp","Industry 2","Occupation 3","Health provider","Work restriction forms","County B","Phone",1,1,null,1,null,0,"Don't want to be in research study",0,null,0,null,"2019-08-27","2019-09-10","2019-10-01",null,null,{"$f":"IF(Table1[[#This Row],[First service received]]=1,\"Never dropped\",IF(Table1[[#This Row],[Enrolled]]=1,\"No first service\",IF(Table1[[#This Row],[Expressed interest]]=1,\"Not enrolled\",IF(Table1[[#This Row],[Eligible]]=1,\"Not interested\",IF(Table1[[#This Row],[Contacted]]=1,\"Not eligible\",IF(Table1[[#This Row],[Identified]]=1,\"Not contacted\",\"\"))))))","v":"Not interested"},{"$f":"_xlfn.CONCAT(Table1[[#This Row],[Reason not contacted]],Table1[[#This Row],[Reason not eligible]],Table1[[#This Row],[Reason not interested]],Table1[[#This Row],[Reason not enrolled]],Table1[[#This Row],[Reason first service not received]])","v":"Don't want to be in research study"}]
[1439,null,"25 to 44 yrs","M","Non-Hispanic/Latino","American Indian or Alaska Native","Yes","Yes","No","Employed","7 to 12","MSK","Work related","Non-workers comp","Industry 4","Occupation 1","Health provider","Clinic appointment schedules","County B","In person",1,1,null,1,null,1,null,1,null,1,null,"2019-08-27","2019-09-11","2019-09-12","2019-10-06","2019-10-12",{"$f":"IF(Table1[[#This Row],[First service received]]=1,\"Never dropped\",IF(Table1[[#This Row],[Enrolled]]=1,\"No first service\",IF(Table1[[#This Row],[Expressed interest]]=1,\"Not enrolled\",IF(Table1[[#This Row],[Eligible]]=1,\"Not interested\",IF(Table1[[#This Row],[Contacted]]=1,\"Not eligible\",IF(Table1[[#This Row],[Identified]]=1,\"Not contacted\",\"\"))))))","v":"Never dropped"},{"$f":"_xlfn.CONCAT(Table1[[#This Row],[Reason not contacted]],Table1[[#This Row],[Reason not eligible]],Table1[[#This Row],[Reason not interested]],Table1[[#This Row],[Reason not enrolled]],Table1[[#This Row],[Reason first service not received]])","v":""}]
[1467,null,"25 to 44 yrs","F","Non-Hispanic/Latino","White","Yes","Yes","No","Employed","2 to 6","MSK","Non-work related","Non-workers comp","Industry 2","Occupation 4","Health provider","Voc rehab centers","County B","Phone",1,0,"Contacted, no response",0,null,0,null,0,null,0,null,"2019-08-27",null,null,null,null,{"$f":"IF(Table1[[#This Row],[First service received]]=1,\"Never dropped\",IF(Table1[[#This Row],[Enrolled]]=1,\"No first service\",IF(Table1[[#This Row],[Expressed interest]]=1,\"Not enrolled\",IF(Table1[[#This Row],[Eligible]]=1,\"Not interested\",IF(Table1[[#This Row],[Contacted]]=1,\"Not eligible\",IF(Table1[[#This Row],[Identified]]=1,\"Not contacted\",\"\"))))))","v":"Not contacted"},{"$f":"_xlfn.CONCAT(Table1[[#This Row],[Reason not contacted]],Table1[[#This Row],[Reason not eligible]],Table1[[#This Row],[Reason not interested]],Table1[[#This Row],[Reason not enrolled]],Table1[[#This Row],[Reason first service not received]])","v":"Contacted, no response"}]
[1551,null,"25 to 44 yrs","M","Non-Hispanic/Latino","Black or African-American","Yes","Yes","No","Employed","7 to 12","Other","Non-work related","Non-workers comp","Industry 1","Occupation 1","Employer","Electronic Health Records","County B","Phone",1,1,null,1,null,1,null,1,null,1,null,"2019-08-27","2019-09-02","2019-09-14","2019-09-24","2019-10-03",{"$f":"IF(Table1[[#This Row],[First service received]]=1,\"Never dropped\",IF(Table1[[#This Row],[Enrolled]]=1,\"No first service\",IF(Table1[[#This Row],[Expressed interest]]=1,\"Not enrolled\",IF(Table1[[#This Row],[Eligible]]=1,\"Not interested\",IF(Table1[[#This Row],[Contacted]]=1,\"Not eligible\",IF(Table1[[#This Row],[Identified]]=1,\"Not contacted\",\"\"))))))","v":"Never dropped"},{"$f":"_xlfn.CONCAT(Table1[[#This Row],[Reason not contacted]],Table1[[#This Row],[Reason not eligible]],Table1[[#This Row],[Reason not interested]],Table1[[#This Row],[Reason not enrolled]],Table1[[#This Row],[Reason first service not received]])","v":""}]
[1576,null,"45 to 64 yrs","F","Non-Hispanic/Latino","Hawaiian or Pacific Islander","Yes","Yes","No","Employed","2 to 6","MSK","Non-work related","Non-workers comp","Industry 3","Occupation 2","Health provider","Worker’s comp database","County B","Phone",1,1,null,1,null,1,null,1,null,1,null,"2019-08-27","2019-09-06","2019-09-17","2019-10-04","2019-10-14",{"$f":"IF(Table1[[#This Row],[First service received]]=1,\"Never dropped\",IF(Table1[[#This Row],[Enrolled]]=1,\"No first service\",IF(Table1[[#This Row],[Expressed interest]]=1,\"Not enrolled\",IF(Table1[[#This Row],[Eligible]]=1,\"Not interested\",IF(Table1[[#This Row],[Contacted]]=1,\"Not eligible\",IF(Table1[[#This Row],[Identified]]=1,\"Not contacted\",\"\"))))))","v":"Never dropped"},{"$f":"_xlfn.CONCAT(Table1[[#This Row],[Reason not contacted]],Table1[[#This Row],[Reason not eligible]],Table1[[#This Row],[Reason not interested]],Table1[[#This Row],[Reason not enrolled]],Table1[[#This Row],[Reason first service not received]])","v":""}]
[1023,"lorem ipsum","25 to 44 yrs","M","Non-Hispanic/Latino","White","Yes","Yes","No","Employed","2 to 6","Other","Work related","Non-workers comp","Industry 3","Occupation 3","Self","Electronic Health Records","County B","In person",1,1,null,0,"Ineligible reason1",0,null,0,null,0,null,"2019-08-28","2019-09-12","2019-09-17",null,null,{"$f":"IF(Table1[[#This Row],[First service received]]=1,\"Never dropped\",IF(Table1[[#This Row],[Enrolled]]=1,\"No first service\",IF(Table1[[#This Row],[Expressed interest]]=1,\"Not enrolled\",IF(Table1[[#This Row],[Eligible]]=1,\"Not interested\",IF(Table1[[#This Row],[Contacted]]=1,\"Not eligible\",IF(Table1[[#This Row],[Identified]]=1,\"Not contacted\",\"\"))))))","v":"Not eligible"},{"$f":"_xlfn.CONCAT(Table1[[#This Row],[Reason not contacted]],Table1[[#This Row],[Reason not eligible]],Table1[[#This Row],[Reason not interested]],Table1[[#This Row],[Reason not enrolled]],Table1[[#This Row],[Reason first service not received]])","v":"Ineligible reason1"}]
[1106,null,"25 to 44 yrs","M","Non-Hispanic/Latino","Other or 2 or more","Yes","Yes","No","Employed","7 to 12","MSK","Non-work related","Non-workers comp","Industry 3","Occupation 2","Employer","Electronic Health Records","County B","Phone",1,1,null,1,null,0,"Don't want to be in research study",0,null,0,null,"2019-08-28","2019-09-10","2019-09-15",null,null,{"$f":"IF(Table1[[#This Row],[First service received]]=1,\"Never dropped\",IF(Table1[[#This Row],[Enrolled]]=1,\"No first service\",IF(Table1[[#This Row],[Expressed interest]]=1,\"Not enrolled\",IF(Table1[[#This Row],[Eligible]]=1,\"Not interested\",IF(Table1[[#This Row],[Contacted]]=1,\"Not eligible\",IF(Table1[[#This Row],[Identified]]=1,\"Not contacted\",\"\"))))))","v":"Not interested"},{"$f":"_xlfn.CONCAT(Table1[[#This Row],[Reason not contacted]],Table1[[#This Row],[Reason not eligible]],Table1[[#This Row],[Reason not interested]],Table1[[#This Row],[Reason not enrolled]],Table1[[#This Row],[Reason first service not received]])","v":"Don't want to be in research study"}]
[1255,null,"45 to 64 yrs","F","Non-Hispanic/Latino","White","No","Yes","No","Employed","2 to 6","MSK","Non-work related","Non-workers comp","Industry 1","Occupation 1","Health provider","Clinic appointment schedules","County B","Email",1,1,null,1,null,1,null,1,null,1,null,"2019-08-28","2019-09-02","2019-09-07","2019-10-02","2019-10-15",{"$f":"IF(Table1[[#This Row],[First service received]]=1,\"Never dropped\",IF(Table1[[#This Row],[Enrolled]]=1,\"No first service\",IF(Table1[[#This Row],[Expressed interest]]=1,\"Not enrolled\",IF(Table1[[#This Row],[Eligible]]=1,\"Not interested\",IF(Table1[[#This Row],[Contacted]]=1,\"Not eligible\",IF(Table1[[#This Row],[Identified]]=1,\"Not contacted\",\"\"))))))","v":"Never dropped"},{"$f":"_xlfn.CONCAT(Table1[[#This Row],[Reason not contacted]],Table1[[#This Row],[Reason not eligible]],Table1[[#This Row],[Reason not interested]],Table1[[#This Row],[Reason not enrolled]],Table1[[#This Row],[Reason first service not received]])","v":""}]
[1283,null,"25 to 44 yrs","M","Non-Hispanic/Latino","White","No","Yes","No","Employed","7 to 12","MSK","Non-work related","Non-workers comp","Industry 3","Occupation 3","Health provider","Work restriction forms","County B","Phone",1,1,null,0,"Ineligible reason1",0,null,0,null,0,null,"2019-08-28","2019-09-12","2019-09-21",null,null,{"$f":"IF(Table1[[#This Row],[First service received]]=1,\"Never dropped\",IF(Table1[[#This Row],[Enrolled]]=1,\"No first service\",IF(Table1[[#This Row],[Expressed interest]]=1,\"Not enrolled\",IF(Table1[[#This Row],[Eligible]]=1,\"Not interested\",IF(Table1[[#This Row],[Contacted]]=1,\"Not eligible\",IF(Table1[[#This Row],[Identified]]=1,\"Not contacted\",\"\"))))))","v":"Not eligible"},{"$f":"_xlfn.CONCAT(Table1[[#This Row],[Reason not contacted]],Table1[[#This Row],[Reason not eligible]],Table1[[#This Row],[Reason not interested]],Table1[[#This Row],[Reason not enrolled]],Table1[[#This Row],[Reason first service not received]])","v":"Ineligible reason1"}]
[1606,null,"25 to 44 yrs","M","Non-Hispanic/Latino","White","Yes","Yes","No","Employed","7 to 12","MSK","Work related","Workers comp","Industry 3","Occupation 2","Health provider","Worker’s comp database","County B","Phone",1,1,null,1,null,1,null,1,null,1,null,"2019-08-28","2019-09-02","2019-09-05","2019-09-19","2019-09-21",{"$f":"IF(Table1[[#This Row],[First service received]]=1,\"Never dropped\",IF(Table1[[#This Row],[Enrolled]]=1,\"No first service\",IF(Table1[[#This Row],[Expressed interest]]=1,\"Not enrolled\",IF(Table1[[#This Row],[Eligible]]=1,\"Not interested\",IF(Table1[[#This Row],[Contacted]]=1,\"Not eligible\",IF(Table1[[#This Row],[Identified]]=1,\"Not contacted\",\"\"))))))","v":"Never dropped"},{"$f":"_xlfn.CONCAT(Table1[[#This Row],[Reason not contacted]],Table1[[#This Row],[Reason not eligible]],Table1[[#This Row],[Reason not interested]],Table1[[#This Row],[Reason not enrolled]],Table1[[#This Row],[Reason first service not received]])","v":""}]
[1080,null,"25 to 44 yrs","F","Non-Hispanic/Latino","White","Yes","Yes","No","Employed","2 to 6","MSK","Non-work related","Non-workers comp","Industry 3","Occupation 2","Health provider","Voc rehab centers","County B","Email",1,0,"Contacted, no response",0,null,0,null,0,null,0,null,"2019-08-29",null,null,null,null,{"$f":"IF(Table1[[#This Row],[First service received]]=1,\"Never dropped\",IF(Table1[[#This Row],[Enrolled]]=1,\"No first service\",IF(Table1[[#This Row],[Expressed interest]]=1,\"Not enrolled\",IF(Table1[[#This Row],[Eligible]]=1,\"Not interested\",IF(Table1[[#This Row],[Contacted]]=1,\"Not eligible\",IF(Table1[[#This Row],[Identified]]=1,\"Not contacted\",\"\"))))))","v":"Not contacted"},{"$f":"_xlfn.CONCAT(Table1[[#This Row],[Reason not contacted]],Table1[[#This Row],[Reason not eligible]],Table1[[#This Row],[Reason not interested]],Table1[[#This Row],[Reason not enrolled]],Table1[[#This Row],[Reason first service not received]])","v":"Contacted, no response"}]
[1511,null,"25 to 44 yrs","F","Non-Hispanic/Latino","White","Yes","Yes","No","Employed","2 to 6","Other","Non-work related","Non-workers comp","Industry 3","Occupation 2","Workforce partner","Electronic Health Records","County B","Phone",1,1,null,0,"Ineligible reason1",0,null,0,null,0,null,"2019-08-29","2019-09-07","2019-09-16",null,null,{"$f":"IF(Table1[[#This Row],[First service received]]=1,\"Never dropped\",IF(Table1[[#This Row],[Enrolled]]=1,\"No first service\",IF(Table1[[#This Row],[Expressed interest]]=1,\"Not enrolled\",IF(Table1[[#This Row],[Eligible]]=1,\"Not interested\",IF(Table1[[#This Row],[Contacted]]=1,\"Not eligible\",IF(Table1[[#This Row],[Identified]]=1,\"Not contacted\",\"\"))))))","v":"Not eligible"},{"$f":"_xlfn.CONCAT(Table1[[#This Row],[Reason not contacted]],Table1[[#This Row],[Reason not eligible]],Table1[[#This Row],[Reason not interested]],Table1[[#This Row],[Reason not enrolled]],Table1[[#This Row],[Reason first service not received]])","v":"Ineligible reason1"}]
[1043,null,"25 to 44 yrs","M","Hispanic/Latino","White","Yes","Yes","No","Employed","7 to 12","MSK","Non-work related","Non-workers comp","Industry 3","Occupation 2","Workforce partner","Electronic Health Records","County B","Phone",1,0,"No contact info",0,null,0,null,0,null,0,null,"2019-08-30",null,null,null,null,{"$f":"IF(Table1[[#This Row],[First service received]]=1,\"Never dropped\",IF(Table1[[#This Row],[Enrolled]]=1,\"No first service\",IF(Table1[[#This Row],[Expressed interest]]=1,\"Not enrolled\",IF(Table1[[#This Row],[Eligible]]=1,\"Not interested\",IF(Table1[[#This Row],[Contacted]]=1,\"Not eligible\",IF(Table1[[#This Row],[Identified]]=1,\"Not contacted\",\"\"))))))","v":"Not contacted"},{"$f":"_xlfn.CONCAT(Table1[[#This Row],[Reason not contacted]],Table1[[#This Row],[Reason not eligible]],Table1[[#This Row],[Reason not interested]],Table1[[#This Row],[Reason not enrolled]],Table1[[#This Row],[Reason first service not received]])","v":"No contact info"}]
[1177,null,"45 to 64 yrs","F","Non-Hispanic/Latino","White","Yes","Yes","No","Employed","2 to 6","MSK","Non-work related","Non-workers comp","Industry 3","Occupation 2","Health provider","Worker’s comp database","County B","Email",1,1,null,1,null,1,null,0,"Not enrolled reason1",0,null,"2019-08-30","2019-09-02","2019-10-06",null,null,{"$f":"IF(Table1[[#This Row],[First service received]]=1,\"Never dropped\",IF(Table1[[#This Row],[Enrolled]]=1,\"No first service\",IF(Table1[[#This Row],[Expressed interest]]=1,\"Not enrolled\",IF(Table1[[#This Row],[Eligible]]=1,\"Not interested\",IF(Table1[[#This Row],[Contacted]]=1,\"Not eligible\",IF(Table1[[#This Row],[Identified]]=1,\"Not contacted\",\"\"))))))","v":"Not enrolled"},{"$f":"_xlfn.CONCAT(Table1[[#This Row],[Reason not contacted]],Table1[[#This Row],[Reason not eligible]],Table1[[#This Row],[Reason not interested]],Table1[[#This Row],[Reason not enrolled]],Table1[[#This Row],[Reason first service not received]])","v":"Not enrolled reason1"}]
[1306,null,"45 to 64 yrs","M","Non-Hispanic/Latino","White","Yes","Yes","No","Employed","2 to 6","MSK","Non-work related","Non-workers comp","Industry 4","Occupation 3","Workforce partner","Electronic Health Records","County B","Phone",1,1,null,1,null,1,null,1,null,1,null,"2019-08-30","2019-09-10","2019-09-15","2019-09-27","2019-09-28",{"$f":"IF(Table1[[#This Row],[First service received]]=1,\"Never dropped\",IF(Table1[[#This Row],[Enrolled]]=1,\"No first service\",IF(Table1[[#This Row],[Expressed interest]]=1,\"Not enrolled\",IF(Table1[[#This Row],[Eligible]]=1,\"Not interested\",IF(Table1[[#This Row],[Contacted]]=1,\"Not eligible\",IF(Table1[[#This Row],[Identified]]=1,\"Not contacted\",\"\"))))))","v":"Never dropped"},{"$f":"_xlfn.CONCAT(Table1[[#This Row],[Reason not contacted]],Table1[[#This Row],[Reason not eligible]],Table1[[#This Row],[Reason not interested]],Table1[[#This Row],[Reason not enrolled]],Table1[[#This Row],[Reason first service not received]])","v":""}]
[1412,null,"45 to 64 yrs","M","Non-Hispanic/Latino","White","No","No","No","Employed","2 to 6","MSK","Non-work related","Non-workers comp","Industry 1","Occupation 3","Health provider","Clinic appointment schedules","County B","In person",1,1,null,1,null,1,null,1,null,1,null,"2019-08-30","2019-09-01","2019-09-11","2019-09-25","2019-10-07",{"$f":"IF(Table1[[#This Row],[First service received]]=1,\"Never dropped\",IF(Table1[[#This Row],[Enrolled]]=1,\"No first service\",IF(Table1[[#This Row],[Expressed interest]]=1,\"Not enrolled\",IF(Table1[[#This Row],[Eligible]]=1,\"Not interested\",IF(Table1[[#This Row],[Contacted]]=1,\"Not eligible\",IF(Table1[[#This Row],[Identified]]=1,\"Not contacted\",\"\"))))))","v":"Never dropped"},{"$f":"_xlfn.CONCAT(Table1[[#This Row],[Reason not contacted]],Table1[[#This Row],[Reason not eligible]],Table1[[#This Row],[Reason not interested]],Table1[[#This Row],[Reason not enrolled]],Table1[[#This Row],[Reason first service not received]])","v":""}]
[1574,null,"25 to 44 yrs","F","Non-Hispanic/Latino","White","Yes","No","No","Employed","2 to 6","Cardio or Respiratory","Non-work related","Non-workers comp","Industry 3","Occupation 2","Health provider","Voc rehab centers","County A","In person",1,1,null,1,null,0,"Don't want to be in research study",0,null,0,null,"2019-08-30","2019-09-03","2019-09-09",null,null,{"$f":"IF(Table1[[#This Row],[First service received]]=1,\"Never dropped\",IF(Table1[[#This Row],[Enrolled]]=1,\"No first service\",IF(Table1[[#This Row],[Expressed interest]]=1,\"Not enrolled\",IF(Table1[[#This Row],[Eligible]]=1,\"Not interested\",IF(Table1[[#This Row],[Contacted]]=1,\"Not eligible\",IF(Table1[[#This Row],[Identified]]=1,\"Not contacted\",\"\"))))))","v":"Not interested"},{"$f":"_xlfn.CONCAT(Table1[[#This Row],[Reason not contacted]],Table1[[#This Row],[Reason not eligible]],Table1[[#This Row],[Reason not interested]],Table1[[#This Row],[Reason not enrolled]],Table1[[#This Row],[Reason first service not received]])","v":"Don't want to be in research study"}]
[1344,null,"25 to 44 yrs","M","Non-Hispanic/Latino","White","Yes","Yes","No","Employed","7 to 12","MSK","Work related","Workers comp","Industry 1","Occupation 3","Employer","Electronic Health Records","County B","Email",1,1,null,1,null,0,"Impact on provider relationship",0,null,0,null,"2019-08-31","2019-09-03","2019-10-07",null,null,{"$f":"IF(Table1[[#This Row],[First service received]]=1,\"Never dropped\",IF(Table1[[#This Row],[Enrolled]]=1,\"No first service\",IF(Table1[[#This Row],[Expressed interest]]=1,\"Not enrolled\",IF(Table1[[#This Row],[Eligible]]=1,\"Not interested\",IF(Table1[[#This Row],[Contacted]]=1,\"Not eligible\",IF(Table1[[#This Row],[Identified]]=1,\"Not contacted\",\"\"))))))","v":"Not interested"},{"$f":"_xlfn.CONCAT(Table1[[#This Row],[Reason not contacted]],Table1[[#This Row],[Reason not eligible]],Table1[[#This Row],[Reason not interested]],Table1[[#This Row],[Reason not enrolled]],Table1[[#This Row],[Reason first service not received]])","v":"Impact on provider relationship"}]
[1394,null,"25 to 44 yrs","M","Non-Hispanic/Latino","Black or African-American","Yes","Yes","No","Not Employed","0 to 1","MSK","Non-work related","Non-workers comp","Industry 1","Occupation 4","Self","Electronic Health Records","County B","Phone",1,1,null,1,null,0,"Impact on provider relationship",0,null,0,null,"2019-08-31","2019-09-04","2019-09-11",null,null,{"$f":"IF(Table1[[#This Row],[First service received]]=1,\"Never dropped\",IF(Table1[[#This Row],[Enrolled]]=1,\"No first service\",IF(Table1[[#This Row],[Expressed interest]]=1,\"Not enrolled\",IF(Table1[[#This Row],[Eligible]]=1,\"Not interested\",IF(Table1[[#This Row],[Contacted]]=1,\"Not eligible\",IF(Table1[[#This Row],[Identified]]=1,\"Not contacted\",\"\"))))))","v":"Not interested"},{"$f":"_xlfn.CONCAT(Table1[[#This Row],[Reason not contacted]],Table1[[#This Row],[Reason not eligible]],Table1[[#This Row],[Reason not interested]],Table1[[#This Row],[Reason not enrolled]],Table1[[#This Row],[Reason first service not received]])","v":"Impact on provider relationship"}]
[1444,null,"25 to 44 yrs","M","Non-Hispanic/Latino","White","Yes","Yes","No","Employed","7 to 12","MSK","Non-work related","Non-workers comp","Industry 1","Occupation 1","Self","Electronic Health Records","County C","Phone",1,0,"Contacted, no response",0,null,0,null,0,null,0,null,"2019-08-31",null,null,null,null,{"$f":"IF(Table1[[#This Row],[First service received]]=1,\"Never dropped\",IF(Table1[[#This Row],[Enrolled]]=1,\"No first service\",IF(Table1[[#This Row],[Expressed interest]]=1,\"Not enrolled\",IF(Table1[[#This Row],[Eligible]]=1,\"Not interested\",IF(Table1[[#This Row],[Contacted]]=1,\"Not eligible\",IF(Table1[[#This Row],[Identified]]=1,\"Not contacted\",\"\"))))))","v":"Not contacted"},{"$f":"_xlfn.CONCAT(Table1[[#This Row],[Reason not contacted]],Table1[[#This Row],[Reason not eligible]],Table1[[#This Row],[Reason not interested]],Table1[[#This Row],[Reason not enrolled]],Table1[[#This Row],[Reason first service not received]])","v":"Contacted, no response"}]
[1603,null,"45 to 64 yrs","M","Non-Hispanic/Latino","White","No","Yes","No","Employed","2 to 6","MSK","Work related","Workers comp","Industry 1","Occupation 3","Health provider","FMLA forms","County A","Phone",1,1,null,1,null,0,"Don't want to be in research study",0,null,0,null,"2019-08-31","2019-09-08","2019-10-02",null,null,{"$f":"IF(Table1[[#This Row],[First service received]]=1,\"Never dropped\",IF(Table1[[#This Row],[Enrolled]]=1,\"No first service\",IF(Table1[[#This Row],[Expressed interest]]=1,\"Not enrolled\",IF(Table1[[#This Row],[Eligible]]=1,\"Not interested\",IF(Table1[[#This Row],[Contacted]]=1,\"Not eligible\",IF(Table1[[#This Row],[Identified]]=1,\"Not contacted\",\"\"))))))","v":"Not interested"},{"$f":"_xlfn.CONCAT(Table1[[#This Row],[Reason not contacted]],Table1[[#This Row],[Reason not eligible]],Table1[[#This Row],[Reason not interested]],Table1[[#This Row],[Reason not enrolled]],Table1[[#This Row],[Reason first service not received]])","v":"Don't want to be in research study"}]
[1044,null,"45 to 64 yrs","F","Hispanic/Latino","White","No","Yes","No","Employed","7 to 12","Other","Work related","Workers comp","Industry 3","Occupation 2","Health provider","Work restriction forms","County B","Phone",1,1,null,1,null,0,"Not interested reason3",0,null,0,null,"2019-09-01","2019-09-08","2019-10-22",null,null,{"$f":"IF(Table1[[#This Row],[First service received]]=1,\"Never dropped\",IF(Table1[[#This Row],[Enrolled]]=1,\"No first service\",IF(Table1[[#This Row],[Expressed interest]]=1,\"Not enrolled\",IF(Table1[[#This Row],[Eligible]]=1,\"Not interested\",IF(Table1[[#This Row],[Contacted]]=1,\"Not eligible\",IF(Table1[[#This Row],[Identified]]=1,\"Not contacted\",\"\"))))))","v":"Not interested"},{"$f":"_xlfn.CONCAT(Table1[[#This Row],[Reason not contacted]],Table1[[#This Row],[Reason not eligible]],Table1[[#This Row],[Reason not interested]],Table1[[#This Row],[Reason not enrolled]],Table1[[#This Row],[Reason first service not received]])","v":"Not interested reason3"}]
[1048,null,"25 to 44 yrs","M","Non-Hispanic/Latino","Black or African-American","No","Yes","No","Employed","7 to 12","MSK","Work related","Workers comp","Industry 1","Occupation 1","Self","Electronic Health Records","County B","In person",1,1,null,1,null,0,"Don't want to be in research study",0,null,0,null,"2019-09-01","2019-09-05","2019-09-27",null,null,{"$f":"IF(Table1[[#This Row],[First service received]]=1,\"Never dropped\",IF(Table1[[#This Row],[Enrolled]]=1,\"No first service\",IF(Table1[[#This Row],[Expressed interest]]=1,\"Not enrolled\",IF(Table1[[#This Row],[Eligible]]=1,\"Not interested\",IF(Table1[[#This Row],[Contacted]]=1,\"Not eligible\",IF(Table1[[#This Row],[Identified]]=1,\"Not contacted\",\"\"))))))","v":"Not interested"},{"$f":"_xlfn.CONCAT(Table1[[#This Row],[Reason not contacted]],Table1[[#This Row],[Reason not eligible]],Table1[[#This Row],[Reason not interested]],Table1[[#This Row],[Reason not enrolled]],Table1[[#This Row],[Reason first service not received]])","v":"Don't want to be in research study"}]
[1112,null,"65 yrs +","M","Non-Hispanic/Latino","Black or African-American","Yes","Yes","No","Employed","2 to 6","MSK","Non-work related","Non-workers comp","Industry 3","Occupation 2","Health provider","Clinic appointment schedules","County B","Phone",1,1,null,1,null,0,"Not interested reason3",0,null,0,null,"2019-09-01","2019-09-09","2019-10-19",null,null,{"$f":"IF(Table1[[#This Row],[First service received]]=1,\"Never dropped\",IF(Table1[[#This Row],[Enrolled]]=1,\"No first service\",IF(Table1[[#This Row],[Expressed interest]]=1,\"Not enrolled\",IF(Table1[[#This Row],[Eligible]]=1,\"Not interested\",IF(Table1[[#This Row],[Contacted]]=1,\"Not eligible\",IF(Table1[[#This Row],[Identified]]=1,\"Not contacted\",\"\"))))))","v":"Not interested"},{"$f":"_xlfn.CONCAT(Table1[[#This Row],[Reason not contacted]],Table1[[#This Row],[Reason not eligible]],Table1[[#This Row],[Reason not interested]],Table1[[#This Row],[Reason not enrolled]],Table1[[#This Row],[Reason first service not received]])","v":"Not interested reason3"}]
[1126,null,"45 to 64 yrs","M","Non-Hispanic/Latino","White","Yes","Yes","No","Employed","7 to 12","MSK","Non-work related","Non-workers comp","Industry 2","Occupation 1","Health provider","Worker’s comp database","County B","Phone",1,1,null,1,null,1,null,0,"Not enrolled reason1",0,null,"2019-09-01","2019-09-15","2019-10-23",null,null,{"$f":"IF(Table1[[#This Row],[First service received]]=1,\"Never dropped\",IF(Table1[[#This Row],[Enrolled]]=1,\"No first service\",IF(Table1[[#This Row],[Expressed interest]]=1,\"Not enrolled\",IF(Table1[[#This Row],[Eligible]]=1,\"Not interested\",IF(Table1[[#This Row],[Contacted]]=1,\"Not eligible\",IF(Table1[[#This Row],[Identified]]=1,\"Not contacted\",\"\"))))))","v":"Not enrolled"},{"$f":"_xlfn.CONCAT(Table1[[#This Row],[Reason not contacted]],Table1[[#This Row],[Reason not eligible]],Table1[[#This Row],[Reason not interested]],Table1[[#This Row],[Reason not enrolled]],Table1[[#This Row],[Reason first service not received]])","v":"Not enrolled reason1"}]
[1199,null,"25 to 44 yrs","F","Non-Hispanic/Latino","Other or 2 or more","No","Yes","No","Not Employed","0 to 1","Other","Work related","Non-workers comp","Industry 1","Occupation 4","Health provider","Clinic appointment schedules","County B","Email",1,0,"Contacted, no response",0,null,0,null,0,null,0,null,"2019-09-01",null,null,null,null,{"$f":"IF(Table1[[#This Row],[First service received]]=1,\"Never dropped\",IF(Table1[[#This Row],[Enrolled]]=1,\"No first service\",IF(Table1[[#This Row],[Expressed interest]]=1,\"Not enrolled\",IF(Table1[[#This Row],[Eligible]]=1,\"Not interested\",IF(Table1[[#This Row],[Contacted]]=1,\"Not eligible\",IF(Table1[[#This Row],[Identified]]=1,\"Not contacted\",\"\"))))))","v":"Not contacted"},{"$f":"_xlfn.CONCAT(Table1[[#This Row],[Reason not contacted]],Table1[[#This Row],[Reason not eligible]],Table1[[#This Row],[Reason not interested]],Table1[[#This Row],[Reason not enrolled]],Table1[[#This Row],[Reason first service not received]])","v":"Contacted, no response"}]
[1240,null,"65 yrs +","M","Non-Hispanic/Latino","White","Yes","Yes","No","Employed","7 to 12","MSK","Non-work related","Non-workers comp","Industry 1","Occupation 3","Health provider","Worker’s comp database","County C","Email",1,1,null,1,null,0,"Don't want to be in research study",0,null,0,null,"2019-09-01","2019-09-06","2019-10-05",null,null,{"$f":"IF(Table1[[#This Row],[First service received]]=1,\"Never dropped\",IF(Table1[[#This Row],[Enrolled]]=1,\"No first service\",IF(Table1[[#This Row],[Expressed interest]]=1,\"Not enrolled\",IF(Table1[[#This Row],[Eligible]]=1,\"Not interested\",IF(Table1[[#This Row],[Contacted]]=1,\"Not eligible\",IF(Table1[[#This Row],[Identified]]=1,\"Not contacted\",\"\"))))))","v":"Not interested"},{"$f":"_xlfn.CONCAT(Table1[[#This Row],[Reason not contacted]],Table1[[#This Row],[Reason not eligible]],Table1[[#This Row],[Reason not interested]],Table1[[#This Row],[Reason not enrolled]],Table1[[#This Row],[Reason first service not received]])","v":"Don't want to be in research study"}]
[1254,null,"25 to 44 yrs","M","Hispanic/Latino","White","Yes","Yes","No","Employed","7 to 12","Other","Work related","Non-workers comp","Industry 1","Occupation 1","Workforce partner","Electronic Health Records","County C","In person",1,1,null,1,null,1,null,1,null,1,null,"2019-09-01","2019-09-03","2019-09-04","2019-10-01","2019-10-12",{"$f":"IF(Table1[[#This Row],[First service received]]=1,\"Never dropped\",IF(Table1[[#This Row],[Enrolled]]=1,\"No first service\",IF(Table1[[#This Row],[Expressed interest]]=1,\"Not enrolled\",IF(Table1[[#This Row],[Eligible]]=1,\"Not interested\",IF(Table1[[#This Row],[Contacted]]=1,\"Not eligible\",IF(Table1[[#This Row],[Identified]]=1,\"Not contacted\",\"\"))))))","v":"Never dropped"},{"$f":"_xlfn.CONCAT(Table1[[#This Row],[Reason not contacted]],Table1[[#This Row],[Reason not eligible]],Table1[[#This Row],[Reason not interested]],Table1[[#This Row],[Reason not enrolled]],Table1[[#This Row],[Reason first service not received]])","v":""}]
[1279,null,"25 to 44 yrs","M","Hispanic/Latino","White","Yes","Yes","No","Employed","7 to 12","Other","Work related","Non-workers comp","Industry 1","Occupation 1","Workforce partner","Electronic Health Records","County C","In person",1,1,null,1,null,1,null,1,null,1,null,"2019-09-01","2019-09-03","2019-09-04","2019-10-01","2019-10-12",{"$f":"IF(Table1[[#This Row],[First service received]]=1,\"Never dropped\",IF(Table1[[#This Row],[Enrolled]]=1,\"No first service\",IF(Table1[[#This Row],[Expressed interest]]=1,\"Not enrolled\",IF(Table1[[#This Row],[Eligible]]=1,\"Not interested\",IF(Table1[[#This Row],[Contacted]]=1,\"Not eligible\",IF(Table1[[#This Row],[Identified]]=1,\"Not contacted\",\"\"))))))","v":"Never dropped"},{"$f":"_xlfn.CONCAT(Table1[[#This Row],[Reason not contacted]],Table1[[#This Row],[Reason not eligible]],Table1[[#This Row],[Reason not interested]],Table1[[#This Row],[Reason not enrolled]],Table1[[#This Row],[Reason first service not received]])","v":""}]
[1313,null,"45 to 64 yrs","M","Non-Hispanic/Latino","White","Yes","Yes","No","Not Employed","0 to 1","Cardio or Respiratory","Non-work related","Non-workers comp","Industry 3","Occupation 4","Health provider","Work restriction forms","County A","Phone",1,1,null,0,"Ineligible reason2",0,null,0,null,0,null,"2019-09-01","2019-09-03","2019-09-10",null,null,{"$f":"IF(Table1[[#This Row],[First service received]]=1,\"Never dropped\",IF(Table1[[#This Row],[Enrolled]]=1,\"No first service\",IF(Table1[[#This Row],[Expressed interest]]=1,\"Not enrolled\",IF(Table1[[#This Row],[Eligible]]=1,\"Not interested\",IF(Table1[[#This Row],[Contacted]]=1,\"Not eligible\",IF(Table1[[#This Row],[Identified]]=1,\"Not contacted\",\"\"))))))","v":"Not eligible"},{"$f":"_xlfn.CONCAT(Table1[[#This Row],[Reason not contacted]],Table1[[#This Row],[Reason not eligible]],Table1[[#This Row],[Reason not interested]],Table1[[#This Row],[Reason not enrolled]],Table1[[#This Row],[Reason first service not received]])","v":"Ineligible reason2"}]
[1399,null,"65 yrs +","F","Non-Hispanic/Latino","White","Yes","Yes","No","Not Employed","0 to 1","MSK","Non-work related","Non-workers comp","Industry 2","Occupation 1","Workforce partner","Electronic Health Records","County B","Phone",1,1,null,1,null,1,null,1,null,1,null,"2019-09-01","2019-09-09","2019-09-17","2019-09-23","2019-09-26",{"$f":"IF(Table1[[#This Row],[First service received]]=1,\"Never dropped\",IF(Table1[[#This Row],[Enrolled]]=1,\"No first service\",IF(Table1[[#This Row],[Expressed interest]]=1,\"Not enrolled\",IF(Table1[[#This Row],[Eligible]]=1,\"Not interested\",IF(Table1[[#This Row],[Contacted]]=1,\"Not eligible\",IF(Table1[[#This Row],[Identified]]=1,\"Not contacted\",\"\"))))))","v":"Never dropped"},{"$f":"_xlfn.CONCAT(Table1[[#This Row],[Reason not contacted]],Table1[[#This Row],[Reason not eligible]],Table1[[#This Row],[Reason not interested]],Table1[[#This Row],[Reason not enrolled]],Table1[[#This Row],[Reason first service not received]])","v":""}]
[1430,null,"65 yrs +","F","Non-Hispanic/Latino","White","Yes","Yes","No","Not Employed","0 to 1","MSK","Non-work related","Non-workers comp","Industry 2","Occupation 1","Workforce partner","Electronic Health Records","County B","Phone",1,1,null,1,null,1,null,1,null,1,null,"2019-09-01","2019-09-09","2019-09-17","2019-09-23","2019-09-26",{"$f":"IF(Table1[[#This Row],[First service received]]=1,\"Never dropped\",IF(Table1[[#This Row],[Enrolled]]=1,\"No first service\",IF(Table1[[#This Row],[Expressed interest]]=1,\"Not enrolled\",IF(Table1[[#This Row],[Eligible]]=1,\"Not interested\",IF(Table1[[#This Row],[Contacted]]=1,\"Not eligible\",IF(Table1[[#This Row],[Identified]]=1,\"Not contacted\",\"\"))))))","v":"Never dropped"},{"$f":"_xlfn.CONCAT(Table1[[#This Row],[Reason not contacted]],Table1[[#This Row],[Reason not eligible]],Table1[[#This Row],[Reason not interested]],Table1[[#This Row],[Reason not enrolled]],Table1[[#This Row],[Reason first service not received]])","v":""}]
[1527,null,"25 to 44 yrs","M","Hispanic/Latino","White","Yes","Yes","No","Employed","7 to 12","Other","Work related","Non-workers comp","Industry 1","Occupation 1","Workforce partner","Electronic Health Records","County C","In person",1,1,null,1,null,1,null,1,null,1,null,"2019-09-01","2019-09-03","2019-09-04","2019-10-01","2019-10-12",{"$f":"IF(Table1[[#This Row],[First service received]]=1,\"Never dropped\",IF(Table1[[#This Row],[Enrolled]]=1,\"No first service\",IF(Table1[[#This Row],[Expressed interest]]=1,\"Not enrolled\",IF(Table1[[#This Row],[Eligible]]=1,\"Not interested\",IF(Table1[[#This Row],[Contacted]]=1,\"Not eligible\",IF(Table1[[#This Row],[Identified]]=1,\"Not contacted\",\"\"))))))","v":"Never dropped"},{"$f":"_xlfn.CONCAT(Table1[[#This Row],[Reason not contacted]],Table1[[#This Row],[Reason not eligible]],Table1[[#This Row],[Reason not interested]],Table1[[#This Row],[Reason not enrolled]],Table1[[#This Row],[Reason first service not received]])","v":""}]
[1609,null,"65 yrs +","F","Non-Hispanic/Latino","White","Yes","Yes","No","Not Employed","0 to 1","MSK","Non-work related","Non-workers comp","Industry 2","Occupation 1","Workforce partner","Electronic Health Records","County B","Phone",1,1,null,1,null,1,null,1,null,1,null,"2019-09-01","2019-09-09","2019-09-17","2019-09-23","2019-09-26",{"$f":"IF(Table1[[#This Row],[First service received]]=1,\"Never dropped\",IF(Table1[[#This Row],[Enrolled]]=1,\"No first service\",IF(Table1[[#This Row],[Expressed interest]]=1,\"Not enrolled\",IF(Table1[[#This Row],[Eligible]]=1,\"Not interested\",IF(Table1[[#This Row],[Contacted]]=1,\"Not eligible\",IF(Table1[[#This Row],[Identified]]=1,\"Not contacted\",\"\"))))))","v":"Never dropped"},{"$f":"_xlfn.CONCAT(Table1[[#This Row],[Reason not contacted]],Table1[[#This Row],[Reason not eligible]],Table1[[#This Row],[Reason not interested]],Table1[[#This Row],[Reason not enrolled]],Table1[[#This Row],[Reason first service not received]])","v":""}]
[1060,null,"25 to 44 yrs","M","Non-Hispanic/Latino","White","No","Yes","Yes","Employed","2 to 6","MSK","Non-work related","Non-workers comp","Industry 3","Occupation 1","Health provider","Clinic appointment schedules","County B","Email",1,1,null,1,null,1,null,1,null,0,"Health problems","2019-09-02","2019-09-09","2019-09-13","2019-09-24",null,{"$f":"IF(Table1[[#This Row],[First service received]]=1,\"Never dropped\",IF(Table1[[#This Row],[Enrolled]]=1,\"No first service\",IF(Table1[[#This Row],[Expressed interest]]=1,\"Not enrolled\",IF(Table1[[#This Row],[Eligible]]=1,\"Not interested\",IF(Table1[[#This Row],[Contacted]]=1,\"Not eligible\",IF(Table1[[#This Row],[Identified]]=1,\"Not contacted\",\"\"))))))","v":"No first service"},{"$f":"_xlfn.CONCAT(Table1[[#This Row],[Reason not contacted]],Table1[[#This Row],[Reason not eligible]],Table1[[#This Row],[Reason not interested]],Table1[[#This Row],[Reason not enrolled]],Table1[[#This Row],[Reason first service not received]])","v":"Health problems"}]
[1071,null,"25 to 44 yrs","M","Non-Hispanic/Latino","White","No","Yes","Yes","Employed","2 to 6","MSK","Non-work related","Non-workers comp","Industry 3","Occupation 1","Health provider","Clinic appointment schedules","County B","Email",1,1,null,1,null,1,null,1,null,0,"Health problems","2019-09-02","2019-09-09","2019-09-13","2019-09-24",null,{"$f":"IF(Table1[[#This Row],[First service received]]=1,\"Never dropped\",IF(Table1[[#This Row],[Enrolled]]=1,\"No first service\",IF(Table1[[#This Row],[Expressed interest]]=1,\"Not enrolled\",IF(Table1[[#This Row],[Eligible]]=1,\"Not interested\",IF(Table1[[#This Row],[Contacted]]=1,\"Not eligible\",IF(Table1[[#This Row],[Identified]]=1,\"Not contacted\",\"\"))))))","v":"No first service"},{"$f":"_xlfn.CONCAT(Table1[[#This Row],[Reason not contacted]],Table1[[#This Row],[Reason not eligible]],Table1[[#This Row],[Reason not interested]],Table1[[#This Row],[Reason not enrolled]],Table1[[#This Row],[Reason first service not received]])","v":"Health problems"}]
[1095,null,"45 to 64 yrs","M","Non-Hispanic/Latino","Other or 2 or more","Yes","Yes","No","Employed","7 to 12","MSK","Non-work related","Non-workers comp","Industry 1","Occupation 1","Health provider","Clinic appointment schedules","County B","Phone",1,1,null,1,null,0,"Impact on provider relationship",0,null,0,null,"2019-09-02","2019-09-09","2019-09-23",null,null,{"$f":"IF(Table1[[#This Row],[First service received]]=1,\"Never dropped\",IF(Table1[[#This Row],[Enrolled]]=1,\"No first service\",IF(Table1[[#This Row],[Expressed interest]]=1,\"Not enrolled\",IF(Table1[[#This Row],[Eligible]]=1,\"Not interested\",IF(Table1[[#This Row],[Contacted]]=1,\"Not eligible\",IF(Table1[[#This Row],[Identified]]=1,\"Not contacted\",\"\"))))))","v":"Not interested"},{"$f":"_xlfn.CONCAT(Table1[[#This Row],[Reason not contacted]],Table1[[#This Row],[Reason not eligible]],Table1[[#This Row],[Reason not interested]],Table1[[#This Row],[Reason not enrolled]],Table1[[#This Row],[Reason first service not received]])","v":"Impact on provider relationship"}]
[1215,null,"25 to 44 yrs","M","Non-Hispanic/Latino","White","No","Yes","Yes","Employed","2 to 6","MSK","Non-work related","Non-workers comp","Industry 3","Occupation 1","Health provider","Clinic appointment schedules","County B","Email",1,1,null,1,null,1,null,1,null,0,"Health problems","2019-09-02","2019-09-09","2019-09-13","2019-09-24",null,{"$f":"IF(Table1[[#This Row],[First service received]]=1,\"Never dropped\",IF(Table1[[#This Row],[Enrolled]]=1,\"No first service\",IF(Table1[[#This Row],[Expressed interest]]=1,\"Not enrolled\",IF(Table1[[#This Row],[Eligible]]=1,\"Not interested\",IF(Table1[[#This Row],[Contacted]]=1,\"Not eligible\",IF(Table1[[#This Row],[Identified]]=1,\"Not contacted\",\"\"))))))","v":"No first service"},{"$f":"_xlfn.CONCAT(Table1[[#This Row],[Reason not contacted]],Table1[[#This Row],[Reason not eligible]],Table1[[#This Row],[Reason not interested]],Table1[[#This Row],[Reason not enrolled]],Table1[[#This Row],[Reason first service not received]])","v":"Health problems"}]
[1250,null,"45 to 64 yrs","F","Hispanic/Latino","White","Yes","Yes","No","Employed","13+ weeks","MSK","Non-work related","Non-workers comp","Industry 1","Occupation 3","Health provider","FMLA forms","County B","Email",1,1,null,1,null,1,null,1,null,1,null,"2019-09-02","2019-09-07","2019-09-15","2019-09-27","2019-10-07",{"$f":"IF(Table1[[#This Row],[First service received]]=1,\"Never dropped\",IF(Table1[[#This Row],[Enrolled]]=1,\"No first service\",IF(Table1[[#This Row],[Expressed interest]]=1,\"Not enrolled\",IF(Table1[[#This Row],[Eligible]]=1,\"Not interested\",IF(Table1[[#This Row],[Contacted]]=1,\"Not eligible\",IF(Table1[[#This Row],[Identified]]=1,\"Not contacted\",\"\"))))))","v":"Never dropped"},{"$f":"_xlfn.CONCAT(Table1[[#This Row],[Reason not contacted]],Table1[[#This Row],[Reason not eligible]],Table1[[#This Row],[Reason not interested]],Table1[[#This Row],[Reason not enrolled]],Table1[[#This Row],[Reason first service not received]])","v":""}]
[1383,null,"25 to 44 yrs","M","Non-Hispanic/Latino","White","No","Yes","Yes","Employed","2 to 6","MSK","Non-work related","Non-workers comp","Industry 3","Occupation 1","Health provider","Clinic appointment schedules","County B","Email",1,1,null,1,null,1,null,1,null,0,"Health problems","2019-09-02","2019-09-09","2019-09-13","2019-09-24",null,{"$f":"IF(Table1[[#This Row],[First service received]]=1,\"Never dropped\",IF(Table1[[#This Row],[Enrolled]]=1,\"No first service\",IF(Table1[[#This Row],[Expressed interest]]=1,\"Not enrolled\",IF(Table1[[#This Row],[Eligible]]=1,\"Not interested\",IF(Table1[[#This Row],[Contacted]]=1,\"Not eligible\",IF(Table1[[#This Row],[Identified]]=1,\"Not contacted\",\"\"))))))","v":"No first service"},{"$f":"_xlfn.CONCAT(Table1[[#This Row],[Reason not contacted]],Table1[[#This Row],[Reason not eligible]],Table1[[#This Row],[Reason not interested]],Table1[[#This Row],[Reason not enrolled]],Table1[[#This Row],[Reason first service not received]])","v":"Health problems"}]
[1489,null,"25 to 44 yrs","M","Non-Hispanic/Latino","White","No","Yes","Yes","Employed","2 to 6","MSK","Non-work related","Non-workers comp","Industry 3","Occupation 1","Health provider","Clinic appointment schedules","County B","Email",1,1,null,1,null,1,null,1,null,0,"Health problems","2019-09-02","2019-09-09","2019-09-13","2019-09-24",null,{"$f":"IF(Table1[[#This Row],[First service received]]=1,\"Never dropped\",IF(Table1[[#This Row],[Enrolled]]=1,\"No first service\",IF(Table1[[#This Row],[Expressed interest]]=1,\"Not enrolled\",IF(Table1[[#This Row],[Eligible]]=1,\"Not interested\",IF(Table1[[#This Row],[Contacted]]=1,\"Not eligible\",IF(Table1[[#This Row],[Identified]]=1,\"Not contacted\",\"\"))))))","v":"No first service"},{"$f":"_xlfn.CONCAT(Table1[[#This Row],[Reason not contacted]],Table1[[#This Row],[Reason not eligible]],Table1[[#This Row],[Reason not interested]],Table1[[#This Row],[Reason not enrolled]],Table1[[#This Row],[Reason first service not received]])","v":"Health problems"}]
[1506,null,"25 to 44 yrs","M","Non-Hispanic/Latino","White","No","Yes","Yes","Employed","2 to 6","MSK","Non-work related","Non-workers comp","Industry 3","Occupation 1","Health provider","Clinic appointment schedules","County B","Email",1,1,null,1,null,1,null,1,null,0,"Health problems","2019-09-02","2019-09-09","2019-09-13","2019-09-24",null,{"$f":"IF(Table1[[#This Row],[First service received]]=1,\"Never dropped\",IF(Table1[[#This Row],[Enrolled]]=1,\"No first service\",IF(Table1[[#This Row],[Expressed interest]]=1,\"Not enrolled\",IF(Table1[[#This Row],[Eligible]]=1,\"Not interested\",IF(Table1[[#This Row],[Contacted]]=1,\"Not eligible\",IF(Table1[[#This Row],[Identified]]=1,\"Not contacted\",\"\"))))))","v":"No first service"},{"$f":"_xlfn.CONCAT(Table1[[#This Row],[Reason not contacted]],Table1[[#This Row],[Reason not eligible]],Table1[[#This Row],[Reason not interested]],Table1[[#This Row],[Reason not enrolled]],Table1[[#This Row],[Reason first service not received]])","v":"Health problems"}]
[1524,null,"25 to 44 yrs","M","Non-Hispanic/Latino","White","No","Yes","Yes","Employed","2 to 6","MSK","Non-work related","Non-workers comp","Industry 3","Occupation 1","Health provider","Clinic appointment schedules","County B","Email",1,1,null,1,null,1,null,1,null,0,"Health problems","2019-09-02","2019-09-09","2019-09-13","2019-09-24",null,{"$f":"IF(Table1[[#This Row],[First service received]]=1,\"Never dropped\",IF(Table1[[#This Row],[Enrolled]]=1,\"No first service\",IF(Table1[[#This Row],[Expressed interest]]=1,\"Not enrolled\",IF(Table1[[#This Row],[Eligible]]=1,\"Not interested\",IF(Table1[[#This Row],[Contacted]]=1,\"Not eligible\",IF(Table1[[#This Row],[Identified]]=1,\"Not contacted\",\"\"))))))","v":"No first service"},{"$f":"_xlfn.CONCAT(Table1[[#This Row],[Reason not contacted]],Table1[[#This Row],[Reason not eligible]],Table1[[#This Row],[Reason not interested]],Table1[[#This Row],[Reason not enrolled]],Table1[[#This Row],[Reason first service not received]])","v":"Health problems"}]
[1560,null,"45 to 64 yrs","M","Non-Hispanic/Latino","White","Yes","Yes","No","Employed","2 to 6","MSK","Non-work related","Non-workers comp","Industry 3","Occupation 2","Health provider","Work restriction forms","County B","Email",1,1,null,1,null,0,"Not interested reason3",0,null,0,null,"2019-09-02","2019-09-04","2019-09-13",null,null,{"$f":"IF(Table1[[#This Row],[First service received]]=1,\"Never dropped\",IF(Table1[[#This Row],[Enrolled]]=1,\"No first service\",IF(Table1[[#This Row],[Expressed interest]]=1,\"Not enrolled\",IF(Table1[[#This Row],[Eligible]]=1,\"Not interested\",IF(Table1[[#This Row],[Contacted]]=1,\"Not eligible\",IF(Table1[[#This Row],[Identified]]=1,\"Not contacted\",\"\"))))))","v":"Not interested"},{"$f":"_xlfn.CONCAT(Table1[[#This Row],[Reason not contacted]],Table1[[#This Row],[Reason not eligible]],Table1[[#This Row],[Reason not interested]],Table1[[#This Row],[Reason not enrolled]],Table1[[#This Row],[Reason first service not received]])","v":"Not interested reason3"}]
[1595,null,"45 to 64 yrs","F","Hispanic/Latino","White","Yes","Yes","No","Employed","13+ weeks","MSK","Non-work related","Non-workers comp","Industry 1","Occupation 3","Health provider","FMLA forms","County B","Email",1,1,null,1,null,1,null,1,null,1,null,"2019-09-02","2019-09-07","2019-09-15","2019-09-27","2019-10-07",{"$f":"IF(Table1[[#This Row],[First service received]]=1,\"Never dropped\",IF(Table1[[#This Row],[Enrolled]]=1,\"No first service\",IF(Table1[[#This Row],[Expressed interest]]=1,\"Not enrolled\",IF(Table1[[#This Row],[Eligible]]=1,\"Not interested\",IF(Table1[[#This Row],[Contacted]]=1,\"Not eligible\",IF(Table1[[#This Row],[Identified]]=1,\"Not contacted\",\"\"))))))","v":"Never dropped"},{"$f":"_xlfn.CONCAT(Table1[[#This Row],[Reason not contacted]],Table1[[#This Row],[Reason not eligible]],Table1[[#This Row],[Reason not interested]],Table1[[#This Row],[Reason not enrolled]],Table1[[#This Row],[Reason first service not received]])","v":""}]
[1597,null,"45 to 64 yrs","F","Hispanic/Latino","White","Yes","Yes","No","Employed","13+ weeks","MSK","Non-work related","Non-workers comp","Industry 1","Occupation 3","Health provider","FMLA forms","County B","Email",1,1,null,1,null,1,null,1,null,1,null,"2019-09-02","2019-09-07","2019-09-15","2019-09-27","2019-10-07",{"$f":"IF(Table1[[#This Row],[First service received]]=1,\"Never dropped\",IF(Table1[[#This Row],[Enrolled]]=1,\"No first service\",IF(Table1[[#This Row],[Expressed interest]]=1,\"Not enrolled\",IF(Table1[[#This Row],[Eligible]]=1,\"Not interested\",IF(Table1[[#This Row],[Contacted]]=1,\"Not eligible\",IF(Table1[[#This Row],[Identified]]=1,\"Not contacted\",\"\"))))))","v":"Never dropped"},{"$f":"_xlfn.CONCAT(Table1[[#This Row],[Reason not contacted]],Table1[[#This Row],[Reason not eligible]],Table1[[#This Row],[Reason not interested]],Table1[[#This Row],[Reason not enrolled]],Table1[[#This Row],[Reason first service not received]])","v":""}]
[1054,null,"45 to 64 yrs","M","Non-Hispanic/Latino","Black or African-American","Yes","Yes","No","Employed","7 to 12","MSK","Work related","Workers comp","Industry 1","Occupation 3","Health provider","Worker’s comp database","County B","In person",1,1,null,1,null,1,null,1,null,1,null,"2019-09-03","2019-09-11","2019-09-16","2019-10-01","2019-10-12",{"$f":"IF(Table1[[#This Row],[First service received]]=1,\"Never dropped\",IF(Table1[[#This Row],[Enrolled]]=1,\"No first service\",IF(Table1[[#This Row],[Expressed interest]]=1,\"Not enrolled\",IF(Table1[[#This Row],[Eligible]]=1,\"Not interested\",IF(Table1[[#This Row],[Contacted]]=1,\"Not eligible\",IF(Table1[[#This Row],[Identified]]=1,\"Not contacted\",\"\"))))))","v":"Never dropped"},{"$f":"_xlfn.CONCAT(Table1[[#This Row],[Reason not contacted]],Table1[[#This Row],[Reason not eligible]],Table1[[#This Row],[Reason not interested]],Table1[[#This Row],[Reason not enrolled]],Table1[[#This Row],[Reason first service not received]])","v":""}]
[1230,null,"45 to 64 yrs","M","Non-Hispanic/Latino","Black or African-American","Yes","Yes","No","Employed","7 to 12","MSK","Work related","Workers comp","Industry 1","Occupation 3","Health provider","Worker’s comp database","County B","In person",1,1,null,1,null,1,null,1,null,1,null,"2019-09-03","2019-09-11","2019-09-16","2019-10-01","2019-10-12",{"$f":"IF(Table1[[#This Row],[First service received]]=1,\"Never dropped\",IF(Table1[[#This Row],[Enrolled]]=1,\"No first service\",IF(Table1[[#This Row],[Expressed interest]]=1,\"Not enrolled\",IF(Table1[[#This Row],[Eligible]]=1,\"Not interested\",IF(Table1[[#This Row],[Contacted]]=1,\"Not eligible\",IF(Table1[[#This Row],[Identified]]=1,\"Not contacted\",\"\"))))))","v":"Never dropped"},{"$f":"_xlfn.CONCAT(Table1[[#This Row],[Reason not contacted]],Table1[[#This Row],[Reason not eligible]],Table1[[#This Row],[Reason not interested]],Table1[[#This Row],[Reason not enrolled]],Table1[[#This Row],[Reason first service not received]])","v":""}]
[1264,null,"45 to 64 yrs","F","Non-Hispanic/Latino","White","Yes","Yes","No","Employed","7 to 12","MSK","Non-work related","Non-workers comp","Industry 1","Occupation 4","Health provider","Voc rehab centers","County B","In person",1,1,null,1,null,0,"Impact on provider relationship",0,null,0,null,"2019-09-03","2019-09-14","2019-09-28",null,null,{"$f":"IF(Table1[[#This Row],[First service received]]=1,\"Never dropped\",IF(Table1[[#This Row],[Enrolled]]=1,\"No first service\",IF(Table1[[#This Row],[Expressed interest]]=1,\"Not enrolled\",IF(Table1[[#This Row],[Eligible]]=1,\"Not interested\",IF(Table1[[#This Row],[Contacted]]=1,\"Not eligible\",IF(Table1[[#This Row],[Identified]]=1,\"Not contacted\",\"\"))))))","v":"Not interested"},{"$f":"_xlfn.CONCAT(Table1[[#This Row],[Reason not contacted]],Table1[[#This Row],[Reason not eligible]],Table1[[#This Row],[Reason not interested]],Table1[[#This Row],[Reason not enrolled]],Table1[[#This Row],[Reason first service not received]])","v":"Impact on provider relationship"}]
[1265,null,"25 to 44 yrs","M","Hispanic/Latino","White","No","Yes","No","Employed","7 to 12","MSK","Work related","Workers comp","Industry 2","Occupation 3","Health provider","Clinic appointment schedules","County B","In person",1,1,null,1,null,0,"Don't want to be in research study",0,null,0,null,"2019-09-03","2019-09-16","2019-10-06",null,null,{"$f":"IF(Table1[[#This Row],[First service received]]=1,\"Never dropped\",IF(Table1[[#This Row],[Enrolled]]=1,\"No first service\",IF(Table1[[#This Row],[Expressed interest]]=1,\"Not enrolled\",IF(Table1[[#This Row],[Eligible]]=1,\"Not interested\",IF(Table1[[#This Row],[Contacted]]=1,\"Not eligible\",IF(Table1[[#This Row],[Identified]]=1,\"Not contacted\",\"\"))))))","v":"Not interested"},{"$f":"_xlfn.CONCAT(Table1[[#This Row],[Reason not contacted]],Table1[[#This Row],[Reason not eligible]],Table1[[#This Row],[Reason not interested]],Table1[[#This Row],[Reason not enrolled]],Table1[[#This Row],[Reason first service not received]])","v":"Don't want to be in research study"}]
[1406,null,"45 to 64 yrs","M","Non-Hispanic/Latino","Black or African-American","Yes","Yes","No","Employed","7 to 12","MSK","Work related","Workers comp","Industry 1","Occupation 3","Health provider","Worker’s comp database","County B","In person",1,1,null,1,null,1,null,1,null,1,null,"2019-09-03","2019-09-11","2019-09-16","2019-10-01","2019-10-12",{"$f":"IF(Table1[[#This Row],[First service received]]=1,\"Never dropped\",IF(Table1[[#This Row],[Enrolled]]=1,\"No first service\",IF(Table1[[#This Row],[Expressed interest]]=1,\"Not enrolled\",IF(Table1[[#This Row],[Eligible]]=1,\"Not interested\",IF(Table1[[#This Row],[Contacted]]=1,\"Not eligible\",IF(Table1[[#This Row],[Identified]]=1,\"Not contacted\",\"\"))))))","v":"Never dropped"},{"$f":"_xlfn.CONCAT(Table1[[#This Row],[Reason not contacted]],Table1[[#This Row],[Reason not eligible]],Table1[[#This Row],[Reason not interested]],Table1[[#This Row],[Reason not enrolled]],Table1[[#This Row],[Reason first service not received]])","v":""}]
[1472,null,"25 to 44 yrs","F","Non-Hispanic/Latino","Other or 2 or more","Yes","Yes","No","Employed","13+ weeks","MSK","Non-work related","Non-workers comp","Industry 3","Occupation 2","Health provider","Clinic appointment schedules","County B","Phone",1,1,null,1,null,0,"Don't want to be in research study",0,null,0,null,"2019-09-03","2019-09-15","2019-10-23",null,null,{"$f":"IF(Table1[[#This Row],[First service received]]=1,\"Never dropped\",IF(Table1[[#This Row],[Enrolled]]=1,\"No first service\",IF(Table1[[#This Row],[Expressed interest]]=1,\"Not enrolled\",IF(Table1[[#This Row],[Eligible]]=1,\"Not interested\",IF(Table1[[#This Row],[Contacted]]=1,\"Not eligible\",IF(Table1[[#This Row],[Identified]]=1,\"Not contacted\",\"\"))))))","v":"Not interested"},{"$f":"_xlfn.CONCAT(Table1[[#This Row],[Reason not contacted]],Table1[[#This Row],[Reason not eligible]],Table1[[#This Row],[Reason not interested]],Table1[[#This Row],[Reason not enrolled]],Table1[[#This Row],[Reason first service not received]])","v":"Don't want to be in research study"}]
[1618,null,"25 to 44 yrs","F","Non-Hispanic/Latino","Black or African-American","Yes","Yes","No","Employed","13+ weeks","MSK","Work related","Non-workers comp","Industry 1","Occupation 4","Employer","Electronic Health Records","County B","Phone",1,1,null,0,"Ineligible reason3",0,null,0,null,0,null,"2019-09-03","2019-09-12","2019-10-20",null,null,{"$f":"IF(Table1[[#This Row],[First service received]]=1,\"Never dropped\",IF(Table1[[#This Row],[Enrolled]]=1,\"No first service\",IF(Table1[[#This Row],[Expressed interest]]=1,\"Not enrolled\",IF(Table1[[#This Row],[Eligible]]=1,\"Not interested\",IF(Table1[[#This Row],[Contacted]]=1,\"Not eligible\",IF(Table1[[#This Row],[Identified]]=1,\"Not contacted\",\"\"))))))","v":"Not eligible"},{"$f":"_xlfn.CONCAT(Table1[[#This Row],[Reason not contacted]],Table1[[#This Row],[Reason not eligible]],Table1[[#This Row],[Reason not interested]],Table1[[#This Row],[Reason not enrolled]],Table1[[#This Row],[Reason first service not received]])","v":"Ineligible reason3"}]
[1019,"lorem ipsum","25 to 44 yrs","M","Non-Hispanic/Latino","White","No","Yes","No","Employed","2 to 6","MSK","Non-work related","Non-workers comp","Industry 3","Occupation 2","Health provider","Worker’s comp database","County B","Phone",1,1,null,1,null,1,null,0,"Circumstances changed",0,null,"2019-09-04","2019-09-07","2019-09-16",null,null,{"$f":"IF(Table1[[#This Row],[First service received]]=1,\"Never dropped\",IF(Table1[[#This Row],[Enrolled]]=1,\"No first service\",IF(Table1[[#This Row],[Expressed interest]]=1,\"Not enrolled\",IF(Table1[[#This Row],[Eligible]]=1,\"Not interested\",IF(Table1[[#This Row],[Contacted]]=1,\"Not eligible\",IF(Table1[[#This Row],[Identified]]=1,\"Not contacted\",\"\"))))))","v":"Not enrolled"},{"$f":"_xlfn.CONCAT(Table1[[#This Row],[Reason not contacted]],Table1[[#This Row],[Reason not eligible]],Table1[[#This Row],[Reason not interested]],Table1[[#This Row],[Reason not enrolled]],Table1[[#This Row],[Reason first service not received]])","v":"Circumstances changed"}]
[1069,null,"45 to 64 yrs","F","Hispanic/Latino","White","No","Yes","No","Not Employed","0 to 1","MSK","Non-work related","Non-workers comp","Industry 1","Occupation 3","Health provider","Worker’s comp database","County B","Phone",1,1,null,1,null,1,null,1,null,1,null,"2019-09-04","2019-09-08","2019-09-19","2019-10-06","2019-10-19",{"$f":"IF(Table1[[#This Row],[First service received]]=1,\"Never dropped\",IF(Table1[[#This Row],[Enrolled]]=1,\"No first service\",IF(Table1[[#This Row],[Expressed interest]]=1,\"Not enrolled\",IF(Table1[[#This Row],[Eligible]]=1,\"Not interested\",IF(Table1[[#This Row],[Contacted]]=1,\"Not eligible\",IF(Table1[[#This Row],[Identified]]=1,\"Not contacted\",\"\"))))))","v":"Never dropped"},{"$f":"_xlfn.CONCAT(Table1[[#This Row],[Reason not contacted]],Table1[[#This Row],[Reason not eligible]],Table1[[#This Row],[Reason not interested]],Table1[[#This Row],[Reason not enrolled]],Table1[[#This Row],[Reason first service not received]])","v":""}]
[1154,null,"45 to 64 yrs","F","Non-Hispanic/Latino","White","No","Yes","No","Employed","2 to 6","MSK","Non-work related","Non-workers comp","Industry 3","Occupation 3","Health provider","Work restriction forms","County B","In person",1,1,null,0,"Ineligible reason2",0,null,0,null,0,null,"2019-09-04","2019-09-09","2019-10-04",null,null,{"$f":"IF(Table1[[#This Row],[First service received]]=1,\"Never dropped\",IF(Table1[[#This Row],[Enrolled]]=1,\"No first service\",IF(Table1[[#This Row],[Expressed interest]]=1,\"Not enrolled\",IF(Table1[[#This Row],[Eligible]]=1,\"Not interested\",IF(Table1[[#This Row],[Contacted]]=1,\"Not eligible\",IF(Table1[[#This Row],[Identified]]=1,\"Not contacted\",\"\"))))))","v":"Not eligible"},{"$f":"_xlfn.CONCAT(Table1[[#This Row],[Reason not contacted]],Table1[[#This Row],[Reason not eligible]],Table1[[#This Row],[Reason not interested]],Table1[[#This Row],[Reason not enrolled]],Table1[[#This Row],[Reason first service not received]])","v":"Ineligible reason2"}]
[1189,null,"25 to 44 yrs","F","Non-Hispanic/Latino","White","Yes","Yes","No","Employed","2 to 6","MSK","Non-work related","Non-workers comp","Industry 2","Occupation 3","Health provider","Worker’s comp database","County B","Phone",1,1,null,1,null,1,null,1,null,1,null,"2019-09-04","2019-09-06","2019-09-17","2019-09-23","2019-09-30",{"$f":"IF(Table1[[#This Row],[First service received]]=1,\"Never dropped\",IF(Table1[[#This Row],[Enrolled]]=1,\"No first service\",IF(Table1[[#This Row],[Expressed interest]]=1,\"Not enrolled\",IF(Table1[[#This Row],[Eligible]]=1,\"Not interested\",IF(Table1[[#This Row],[Contacted]]=1,\"Not eligible\",IF(Table1[[#This Row],[Identified]]=1,\"Not contacted\",\"\"))))))","v":"Never dropped"},{"$f":"_xlfn.CONCAT(Table1[[#This Row],[Reason not contacted]],Table1[[#This Row],[Reason not eligible]],Table1[[#This Row],[Reason not interested]],Table1[[#This Row],[Reason not enrolled]],Table1[[#This Row],[Reason first service not received]])","v":""}]
[1321,null,"25 to 44 yrs","M","Non-Hispanic/Latino","White","Yes","Yes","No","Employed","2 to 6","MSK","Work related","Workers comp","Industry 3","Occupation 3","Employer","Electronic Health Records","County B","In person",1,0,"Contacted, no response",0,null,0,null,0,null,0,null,"2019-09-04",null,null,null,null,{"$f":"IF(Table1[[#This Row],[First service received]]=1,\"Never dropped\",IF(Table1[[#This Row],[Enrolled]]=1,\"No first service\",IF(Table1[[#This Row],[Expressed interest]]=1,\"Not enrolled\",IF(Table1[[#This Row],[Eligible]]=1,\"Not interested\",IF(Table1[[#This Row],[Contacted]]=1,\"Not eligible\",IF(Table1[[#This Row],[Identified]]=1,\"Not contacted\",\"\"))))))","v":"Not contacted"},{"$f":"_xlfn.CONCAT(Table1[[#This Row],[Reason not contacted]],Table1[[#This Row],[Reason not eligible]],Table1[[#This Row],[Reason not interested]],Table1[[#This Row],[Reason not enrolled]],Table1[[#This Row],[Reason first service not received]])","v":"Contacted, no response"}]
[1355,null,"45 to 64 yrs","F","Non-Hispanic/Latino","White","Yes","No","No","Not Employed","0 to 1","MSK","Non-work related","Non-workers comp","Industry 2","Occupation 3","Employer","Electronic Health Records","County B","Phone",1,1,null,0,"Ineligible reason2",0,null,0,null,0,null,"2019-09-04","2019-09-05","2019-09-15",null,null,{"$f":"IF(Table1[[#This Row],[First service received]]=1,\"Never dropped\",IF(Table1[[#This Row],[Enrolled]]=1,\"No first service\",IF(Table1[[#This Row],[Expressed interest]]=1,\"Not enrolled\",IF(Table1[[#This Row],[Eligible]]=1,\"Not interested\",IF(Table1[[#This Row],[Contacted]]=1,\"Not eligible\",IF(Table1[[#This Row],[Identified]]=1,\"Not contacted\",\"\"))))))","v":"Not eligible"},{"$f":"_xlfn.CONCAT(Table1[[#This Row],[Reason not contacted]],Table1[[#This Row],[Reason not eligible]],Table1[[#This Row],[Reason not interested]],Table1[[#This Row],[Reason not enrolled]],Table1[[#This Row],[Reason first service not received]])","v":"Ineligible reason2"}]
[1366,null,"25 to 44 yrs","F","Non-Hispanic/Latino","White","Yes","Yes","No","Employed","2 to 6","MSK","Non-work related","Non-workers comp","Industry 2","Occupation 3","Health provider","Worker’s comp database","County B","Phone",1,1,null,1,null,1,null,1,null,1,null,"2019-09-04","2019-09-06","2019-09-17","2019-09-23","2019-09-30",{"$f":"IF(Table1[[#This Row],[First service received]]=1,\"Never dropped\",IF(Table1[[#This Row],[Enrolled]]=1,\"No first service\",IF(Table1[[#This Row],[Expressed interest]]=1,\"Not enrolled\",IF(Table1[[#This Row],[Eligible]]=1,\"Not interested\",IF(Table1[[#This Row],[Contacted]]=1,\"Not eligible\",IF(Table1[[#This Row],[Identified]]=1,\"Not contacted\",\"\"))))))","v":"Never dropped"},{"$f":"_xlfn.CONCAT(Table1[[#This Row],[Reason not contacted]],Table1[[#This Row],[Reason not eligible]],Table1[[#This Row],[Reason not interested]],Table1[[#This Row],[Reason not enrolled]],Table1[[#This Row],[Reason first service not received]])","v":""}]
[1396,null,"25 to 44 yrs","F","Non-Hispanic/Latino","White","Yes","Yes","No","Employed","2 to 6","MSK","Non-work related","Non-workers comp","Industry 2","Occupation 3","Health provider","Worker’s comp database","County B","Phone",1,1,null,1,null,1,null,1,null,1,null,"2019-09-04","2019-09-06","2019-09-17","2019-09-23","2019-09-30",{"$f":"IF(Table1[[#This Row],[First service received]]=1,\"Never dropped\",IF(Table1[[#This Row],[Enrolled]]=1,\"No first service\",IF(Table1[[#This Row],[Expressed interest]]=1,\"Not enrolled\",IF(Table1[[#This Row],[Eligible]]=1,\"Not interested\",IF(Table1[[#This Row],[Contacted]]=1,\"Not eligible\",IF(Table1[[#This Row],[Identified]]=1,\"Not contacted\",\"\"))))))","v":"Never dropped"},{"$f":"_xlfn.CONCAT(Table1[[#This Row],[Reason not contacted]],Table1[[#This Row],[Reason not eligible]],Table1[[#This Row],[Reason not interested]],Table1[[#This Row],[Reason not enrolled]],Table1[[#This Row],[Reason first service not received]])","v":""}]
[1545,null,"45 to 64 yrs","F","Hispanic/Latino","White","No","Yes","No","Not Employed","0 to 1","MSK","Non-work related","Non-workers comp","Industry 1","Occupation 3","Health provider","Worker’s comp database","County B","Phone",1,1,null,1,null,1,null,1,null,1,null,"2019-09-04","2019-09-08","2019-09-19","2019-10-06","2019-10-19",{"$f":"IF(Table1[[#This Row],[First service received]]=1,\"Never dropped\",IF(Table1[[#This Row],[Enrolled]]=1,\"No first service\",IF(Table1[[#This Row],[Expressed interest]]=1,\"Not enrolled\",IF(Table1[[#This Row],[Eligible]]=1,\"Not interested\",IF(Table1[[#This Row],[Contacted]]=1,\"Not eligible\",IF(Table1[[#This Row],[Identified]]=1,\"Not contacted\",\"\"))))))","v":"Never dropped"},{"$f":"_xlfn.CONCAT(Table1[[#This Row],[Reason not contacted]],Table1[[#This Row],[Reason not eligible]],Table1[[#This Row],[Reason not interested]],Table1[[#This Row],[Reason not enrolled]],Table1[[#This Row],[Reason first service not received]])","v":""}]
[1559,null,"45 to 64 yrs","F","Hispanic/Latino","White","No","Yes","No","Not Employed","0 to 1","MSK","Non-work related","Non-workers comp","Industry 1","Occupation 3","Health provider","Worker’s comp database","County B","Phone",1,1,null,1,null,1,null,1,null,1,null,"2019-09-04","2019-09-08","2019-09-19","2019-10-06","2019-10-19",{"$f":"IF(Table1[[#This Row],[First service received]]=1,\"Never dropped\",IF(Table1[[#This Row],[Enrolled]]=1,\"No first service\",IF(Table1[[#This Row],[Expressed interest]]=1,\"Not enrolled\",IF(Table1[[#This Row],[Eligible]]=1,\"Not interested\",IF(Table1[[#This Row],[Contacted]]=1,\"Not eligible\",IF(Table1[[#This Row],[Identified]]=1,\"Not contacted\",\"\"))))))","v":"Never dropped"},{"$f":"_xlfn.CONCAT(Table1[[#This Row],[Reason not contacted]],Table1[[#This Row],[Reason not eligible]],Table1[[#This Row],[Reason not interested]],Table1[[#This Row],[Reason not enrolled]],Table1[[#This Row],[Reason first service not received]])","v":""}]
[1004,"lorem ipsum","25 to 44 yrs","F","Hispanic/Latino","White","Yes","No","No","Employed","2 to 6","MSK","Non-work related","Non-workers comp","Industry 1","Occupation 3","Self","Electronic Health Records","County C","Phone",1,1,null,1,null,1,null,1,null,1,null,"2019-09-05","2019-09-08","2019-09-18","2019-09-23","2019-10-06",{"$f":"IF(Table1[[#This Row],[First service received]]=1,\"Never dropped\",IF(Table1[[#This Row],[Enrolled]]=1,\"No first service\",IF(Table1[[#This Row],[Expressed interest]]=1,\"Not enrolled\",IF(Table1[[#This Row],[Eligible]]=1,\"Not interested\",IF(Table1[[#This Row],[Contacted]]=1,\"Not eligible\",IF(Table1[[#This Row],[Identified]]=1,\"Not contacted\",\"\"))))))","v":"Never dropped"},{"$f":"_xlfn.CONCAT(Table1[[#This Row],[Reason not contacted]],Table1[[#This Row],[Reason not eligible]],Table1[[#This Row],[Reason not interested]],Table1[[#This Row],[Reason not enrolled]],Table1[[#This Row],[Reason first service not received]])","v":""}]
[1006,"lorem ipsum","45 to 64 yrs","M","Non-Hispanic/Latino","White","Yes","Yes","No","Not Employed","0 to 1","Other","Non-work related","Non-workers comp","Industry 3","Occupation 2","Self","Electronic Health Records","County B","Email",1,1,null,1,null,0,"Don't want to be in research study",0,null,0,null,"2019-09-05","2019-09-20","2019-11-02",null,null,{"$f":"IF(Table1[[#This Row],[First service received]]=1,\"Never dropped\",IF(Table1[[#This Row],[Enrolled]]=1,\"No first service\",IF(Table1[[#This Row],[Expressed interest]]=1,\"Not enrolled\",IF(Table1[[#This Row],[Eligible]]=1,\"Not interested\",IF(Table1[[#This Row],[Contacted]]=1,\"Not eligible\",IF(Table1[[#This Row],[Identified]]=1,\"Not contacted\",\"\"))))))","v":"Not interested"},{"$f":"_xlfn.CONCAT(Table1[[#This Row],[Reason not contacted]],Table1[[#This Row],[Reason not eligible]],Table1[[#This Row],[Reason not interested]],Table1[[#This Row],[Reason not enrolled]],Table1[[#This Row],[Reason first service not received]])","v":"Don't want to be in research study"}]
[1026,"lorem ipsum","25 to 44 yrs","F","Hispanic/Latino","White","Yes","No","No","Employed","2 to 6","MSK","Non-work related","Non-workers comp","Industry 1","Occupation 3","Self","Electronic Health Records","County C","Phone",1,1,null,1,null,1,null,1,null,1,null,"2019-09-05","2019-09-08","2019-09-18","2019-09-23","2019-10-06",{"$f":"IF(Table1[[#This Row],[First service received]]=1,\"Never dropped\",IF(Table1[[#This Row],[Enrolled]]=1,\"No first service\",IF(Table1[[#This Row],[Expressed interest]]=1,\"Not enrolled\",IF(Table1[[#This Row],[Eligible]]=1,\"Not interested\",IF(Table1[[#This Row],[Contacted]]=1,\"Not eligible\",IF(Table1[[#This Row],[Identified]]=1,\"Not contacted\",\"\"))))))","v":"Never dropped"},{"$f":"_xlfn.CONCAT(Table1[[#This Row],[Reason not contacted]],Table1[[#This Row],[Reason not eligible]],Table1[[#This Row],[Reason not interested]],Table1[[#This Row],[Reason not enrolled]],Table1[[#This Row],[Reason first service not received]])","v":""}]
[1055,null,"45 to 64 yrs","M","Non-Hispanic/Latino","White","Yes","Yes","No","Employed","2 to 6","MSK","Work related","Workers comp","Industry 3","Occupation 2","Workforce partner","Electronic Health Records","County B","Email",1,1,null,1,null,1,null,1,null,0,"No show","2019-09-05","2019-09-10","2019-09-19","2019-09-25",null,{"$f":"IF(Table1[[#This Row],[First service received]]=1,\"Never dropped\",IF(Table1[[#This Row],[Enrolled]]=1,\"No first service\",IF(Table1[[#This Row],[Expressed interest]]=1,\"Not enrolled\",IF(Table1[[#This Row],[Eligible]]=1,\"Not interested\",IF(Table1[[#This Row],[Contacted]]=1,\"Not eligible\",IF(Table1[[#This Row],[Identified]]=1,\"Not contacted\",\"\"))))))","v":"No first service"},{"$f":"_xlfn.CONCAT(Table1[[#This Row],[Reason not contacted]],Table1[[#This Row],[Reason not eligible]],Table1[[#This Row],[Reason not interested]],Table1[[#This Row],[Reason not enrolled]],Table1[[#This Row],[Reason first service not received]])","v":"No show"}]
[1067,null,"45 to 64 yrs","M","Hispanic/Latino","White","Yes","Yes","No","Employed","2 to 6","MSK","Non-work related","Non-workers comp","Industry 4","Occupation 3","Employer","Electronic Health Records","County B","Phone",1,1,null,1,null,1,null,1,null,1,null,"2019-09-05","2019-09-20","2019-09-24","2019-10-08","2019-10-16",{"$f":"IF(Table1[[#This Row],[First service received]]=1,\"Never dropped\",IF(Table1[[#This Row],[Enrolled]]=1,\"No first service\",IF(Table1[[#This Row],[Expressed interest]]=1,\"Not enrolled\",IF(Table1[[#This Row],[Eligible]]=1,\"Not interested\",IF(Table1[[#This Row],[Contacted]]=1,\"Not eligible\",IF(Table1[[#This Row],[Identified]]=1,\"Not contacted\",\"\"))))))","v":"Never dropped"},{"$f":"_xlfn.CONCAT(Table1[[#This Row],[Reason not contacted]],Table1[[#This Row],[Reason not eligible]],Table1[[#This Row],[Reason not interested]],Table1[[#This Row],[Reason not enrolled]],Table1[[#This Row],[Reason first service not received]])","v":""}]
[1094,null,"45 to 64 yrs","M","Non-Hispanic/Latino","White","Yes","Yes","No","Employed","2 to 6","MSK","Work related","Workers comp","Industry 3","Occupation 2","Workforce partner","Electronic Health Records","County B","Email",1,1,null,1,null,1,null,1,null,0,"No show","2019-09-05","2019-09-10","2019-09-19","2019-09-25",null,{"$f":"IF(Table1[[#This Row],[First service received]]=1,\"Never dropped\",IF(Table1[[#This Row],[Enrolled]]=1,\"No first service\",IF(Table1[[#This Row],[Expressed interest]]=1,\"Not enrolled\",IF(Table1[[#This Row],[Eligible]]=1,\"Not interested\",IF(Table1[[#This Row],[Contacted]]=1,\"Not eligible\",IF(Table1[[#This Row],[Identified]]=1,\"Not contacted\",\"\"))))))","v":"No first service"},{"$f":"_xlfn.CONCAT(Table1[[#This Row],[Reason not contacted]],Table1[[#This Row],[Reason not eligible]],Table1[[#This Row],[Reason not interested]],Table1[[#This Row],[Reason not enrolled]],Table1[[#This Row],[Reason first service not received]])","v":"No show"}]
[1152,null,"45 to 64 yrs","M","Hispanic/Latino","White","Yes","Yes","No","Employed","2 to 6","MSK","Non-work related","Non-workers comp","Industry 4","Occupation 3","Employer","Electronic Health Records","County B","Phone",1,1,null,1,null,1,null,1,null,1,null,"2019-09-05","2019-09-20","2019-09-24","2019-10-08","2019-10-16",{"$f":"IF(Table1[[#This Row],[First service received]]=1,\"Never dropped\",IF(Table1[[#This Row],[Enrolled]]=1,\"No first service\",IF(Table1[[#This Row],[Expressed interest]]=1,\"Not enrolled\",IF(Table1[[#This Row],[Eligible]]=1,\"Not interested\",IF(Table1[[#This Row],[Contacted]]=1,\"Not eligible\",IF(Table1[[#This Row],[Identified]]=1,\"Not contacted\",\"\"))))))","v":"Never dropped"},{"$f":"_xlfn.CONCAT(Table1[[#This Row],[Reason not contacted]],Table1[[#This Row],[Reason not eligible]],Table1[[#This Row],[Reason not interested]],Table1[[#This Row],[Reason not enrolled]],Table1[[#This Row],[Reason first service not received]])","v":""}]
[1160,null,"45 to 64 yrs","M","Hispanic/Latino","White","Yes","Yes","No","Employed","2 to 6","MSK","Non-work related","Non-workers comp","Industry 4","Occupation 3","Employer","Electronic Health Records","County B","Phone",1,1,null,1,null,1,null,1,null,1,null,"2019-09-05","2019-09-20","2019-09-24","2019-10-08","2019-10-16",{"$f":"IF(Table1[[#This Row],[First service received]]=1,\"Never dropped\",IF(Table1[[#This Row],[Enrolled]]=1,\"No first service\",IF(Table1[[#This Row],[Expressed interest]]=1,\"Not enrolled\",IF(Table1[[#This Row],[Eligible]]=1,\"Not interested\",IF(Table1[[#This Row],[Contacted]]=1,\"Not eligible\",IF(Table1[[#This Row],[Identified]]=1,\"Not contacted\",\"\"))))))","v":"Never dropped"},{"$f":"_xlfn.CONCAT(Table1[[#This Row],[Reason not contacted]],Table1[[#This Row],[Reason not eligible]],Table1[[#This Row],[Reason not interested]],Table1[[#This Row],[Reason not enrolled]],Table1[[#This Row],[Reason first service not received]])","v":""}]
[1179,null,"45 to 64 yrs","M","Non-Hispanic/Latino","White","Yes","Yes","No","Employed","2 to 6","MSK","Work related","Workers comp","Industry 3","Occupation 2","Workforce partner","Electronic Health Records","County B","Email",1,1,null,1,null,1,null,1,null,0,"No show","2019-09-05","2019-09-10","2019-09-19","2019-09-25",null,{"$f":"IF(Table1[[#This Row],[First service received]]=1,\"Never dropped\",IF(Table1[[#This Row],[Enrolled]]=1,\"No first service\",IF(Table1[[#This Row],[Expressed interest]]=1,\"Not enrolled\",IF(Table1[[#This Row],[Eligible]]=1,\"Not interested\",IF(Table1[[#This Row],[Contacted]]=1,\"Not eligible\",IF(Table1[[#This Row],[Identified]]=1,\"Not contacted\",\"\"))))))","v":"No first service"},{"$f":"_xlfn.CONCAT(Table1[[#This Row],[Reason not contacted]],Table1[[#This Row],[Reason not eligible]],Table1[[#This Row],[Reason not interested]],Table1[[#This Row],[Reason not enrolled]],Table1[[#This Row],[Reason first service not received]])","v":"No show"}]
[1191,null,"45 to 64 yrs","M","Non-Hispanic/Latino","White","Yes","Yes","No","Employed","2 to 6","MSK","Work related","Workers comp","Industry 3","Occupation 2","Workforce partner","Electronic Health Records","County B","Email",1,1,null,1,null,1,null,1,null,0,"No show","2019-09-05","2019-09-10","2019-09-19","2019-09-25",null,{"$f":"IF(Table1[[#This Row],[First service received]]=1,\"Never dropped\",IF(Table1[[#This Row],[Enrolled]]=1,\"No first service\",IF(Table1[[#This Row],[Expressed interest]]=1,\"Not enrolled\",IF(Table1[[#This Row],[Eligible]]=1,\"Not interested\",IF(Table1[[#This Row],[Contacted]]=1,\"Not eligible\",IF(Table1[[#This Row],[Identified]]=1,\"Not contacted\",\"\"))))))","v":"No first service"},{"$f":"_xlfn.CONCAT(Table1[[#This Row],[Reason not contacted]],Table1[[#This Row],[Reason not eligible]],Table1[[#This Row],[Reason not interested]],Table1[[#This Row],[Reason not enrolled]],Table1[[#This Row],[Reason first service not received]])","v":"No show"}]
[1196,null,"25 to 44 yrs","F","Non-Hispanic/Latino","White","Yes","Yes","No","Employed","7 to 12","MSK","Non-work related","Non-workers comp","Industry 3","Occupation 2","Health provider","Worker’s comp database","County A","In person",1,1,null,1,null,1,null,1,null,1,null,"2019-09-05","2019-09-17","2019-09-22","2019-10-08","2019-10-18",{"$f":"IF(Table1[[#This Row],[First service received]]=1,\"Never dropped\",IF(Table1[[#This Row],[Enrolled]]=1,\"No first service\",IF(Table1[[#This Row],[Expressed interest]]=1,\"Not enrolled\",IF(Table1[[#This Row],[Eligible]]=1,\"Not interested\",IF(Table1[[#This Row],[Contacted]]=1,\"Not eligible\",IF(Table1[[#This Row],[Identified]]=1,\"Not contacted\",\"\"))))))","v":"Never dropped"},{"$f":"_xlfn.CONCAT(Table1[[#This Row],[Reason not contacted]],Table1[[#This Row],[Reason not eligible]],Table1[[#This Row],[Reason not interested]],Table1[[#This Row],[Reason not enrolled]],Table1[[#This Row],[Reason first service not received]])","v":""}]
[1209,null,"45 to 64 yrs","M","Non-Hispanic/Latino","White","Yes","Yes","No","Employed","2 to 6","MSK","Work related","Workers comp","Industry 3","Occupation 2","Workforce partner","Electronic Health Records","County B","Email",1,1,null,1,null,1,null,1,null,0,"No show","2019-09-05","2019-09-10","2019-09-19","2019-09-25",null,{"$f":"IF(Table1[[#This Row],[First service received]]=1,\"Never dropped\",IF(Table1[[#This Row],[Enrolled]]=1,\"No first service\",IF(Table1[[#This Row],[Expressed interest]]=1,\"Not enrolled\",IF(Table1[[#This Row],[Eligible]]=1,\"Not interested\",IF(Table1[[#This Row],[Contacted]]=1,\"Not eligible\",IF(Table1[[#This Row],[Identified]]=1,\"Not contacted\",\"\"))))))","v":"No first service"},{"$f":"_xlfn.CONCAT(Table1[[#This Row],[Reason not contacted]],Table1[[#This Row],[Reason not eligible]],Table1[[#This Row],[Reason not interested]],Table1[[#This Row],[Reason not enrolled]],Table1[[#This Row],[Reason first service not received]])","v":"No show"}]
[1245,null,"45 to 64 yrs","M","Non-Hispanic/Latino","White","Yes","Yes","No","Employed","2 to 6","MSK","Work related","Workers comp","Industry 3","Occupation 2","Workforce partner","Electronic Health Records","County B","Email",1,1,null,1,null,1,null,1,null,0,"No show","2019-09-05","2019-09-10","2019-09-19","2019-09-25",null,{"$f":"IF(Table1[[#This Row],[First service received]]=1,\"Never dropped\",IF(Table1[[#This Row],[Enrolled]]=1,\"No first service\",IF(Table1[[#This Row],[Expressed interest]]=1,\"Not enrolled\",IF(Table1[[#This Row],[Eligible]]=1,\"Not interested\",IF(Table1[[#This Row],[Contacted]]=1,\"Not eligible\",IF(Table1[[#This Row],[Identified]]=1,\"Not contacted\",\"\"))))))","v":"No first service"},{"$f":"_xlfn.CONCAT(Table1[[#This Row],[Reason not contacted]],Table1[[#This Row],[Reason not eligible]],Table1[[#This Row],[Reason not interested]],Table1[[#This Row],[Reason not enrolled]],Table1[[#This Row],[Reason first service not received]])","v":"No show"}]
[1246,null,"25 to 44 yrs","F","Non-Hispanic/Latino","White","Yes","Yes","No","Employed","7 to 12","MSK","Non-work related","Non-workers comp","Industry 3","Occupation 2","Health provider","Worker’s comp database","County A","In person",1,1,null,1,null,1,null,1,null,1,null,"2019-09-05","2019-09-17","2019-09-22","2019-10-08","2019-10-18",{"$f":"IF(Table1[[#This Row],[First service received]]=1,\"Never dropped\",IF(Table1[[#This Row],[Enrolled]]=1,\"No first service\",IF(Table1[[#This Row],[Expressed interest]]=1,\"Not enrolled\",IF(Table1[[#This Row],[Eligible]]=1,\"Not interested\",IF(Table1[[#This Row],[Contacted]]=1,\"Not eligible\",IF(Table1[[#This Row],[Identified]]=1,\"Not contacted\",\"\"))))))","v":"Never dropped"},{"$f":"_xlfn.CONCAT(Table1[[#This Row],[Reason not contacted]],Table1[[#This Row],[Reason not eligible]],Table1[[#This Row],[Reason not interested]],Table1[[#This Row],[Reason not enrolled]],Table1[[#This Row],[Reason first service not received]])","v":""}]
[1253,null,"25 to 44 yrs","M","Hispanic/Latino","White","Yes","Yes","No","Not Employed","0 to 1","MSK","Work related","Non-workers comp","Industry 1","Occupation 3","Self","Electronic Health Records","County B","Phone",1,1,null,1,null,0,"Not interested reason3",0,null,0,null,"2019-09-05","2019-09-13","2019-10-28",null,null,{"$f":"IF(Table1[[#This Row],[First service received]]=1,\"Never dropped\",IF(Table1[[#This Row],[Enrolled]]=1,\"No first service\",IF(Table1[[#This Row],[Expressed interest]]=1,\"Not enrolled\",IF(Table1[[#This Row],[Eligible]]=1,\"Not interested\",IF(Table1[[#This Row],[Contacted]]=1,\"Not eligible\",IF(Table1[[#This Row],[Identified]]=1,\"Not contacted\",\"\"))))))","v":"Not interested"},{"$f":"_xlfn.CONCAT(Table1[[#This Row],[Reason not contacted]],Table1[[#This Row],[Reason not eligible]],Table1[[#This Row],[Reason not interested]],Table1[[#This Row],[Reason not enrolled]],Table1[[#This Row],[Reason first service not received]])","v":"Not interested reason3"}]
[1349,null,"45 to 64 yrs","M","Non-Hispanic/Latino","White","Yes","Yes","No","Employed","2 to 6","MSK","Work related","Workers comp","Industry 3","Occupation 2","Workforce partner","Electronic Health Records","County B","Email",1,1,null,1,null,1,null,1,null,0,"No show","2019-09-05","2019-09-10","2019-09-19","2019-09-25",null,{"$f":"IF(Table1[[#This Row],[First service received]]=1,\"Never dropped\",IF(Table1[[#This Row],[Enrolled]]=1,\"No first service\",IF(Table1[[#This Row],[Expressed interest]]=1,\"Not enrolled\",IF(Table1[[#This Row],[Eligible]]=1,\"Not interested\",IF(Table1[[#This Row],[Contacted]]=1,\"Not eligible\",IF(Table1[[#This Row],[Identified]]=1,\"Not contacted\",\"\"))))))","v":"No first service"},{"$f":"_xlfn.CONCAT(Table1[[#This Row],[Reason not contacted]],Table1[[#This Row],[Reason not eligible]],Table1[[#This Row],[Reason not interested]],Table1[[#This Row],[Reason not enrolled]],Table1[[#This Row],[Reason first service not received]])","v":"No show"}]
[1434,null,"45 to 64 yrs","M","Non-Hispanic/Latino","White","Yes","Yes","No","Employed","2 to 6","MSK","Work related","Workers comp","Industry 3","Occupation 2","Workforce partner","Electronic Health Records","County B","Email",1,1,null,1,null,1,null,1,null,0,"No show","2019-09-05","2019-09-10","2019-09-19","2019-09-25",null,{"$f":"IF(Table1[[#This Row],[First service received]]=1,\"Never dropped\",IF(Table1[[#This Row],[Enrolled]]=1,\"No first service\",IF(Table1[[#This Row],[Expressed interest]]=1,\"Not enrolled\",IF(Table1[[#This Row],[Eligible]]=1,\"Not interested\",IF(Table1[[#This Row],[Contacted]]=1,\"Not eligible\",IF(Table1[[#This Row],[Identified]]=1,\"Not contacted\",\"\"))))))","v":"No first service"},{"$f":"_xlfn.CONCAT(Table1[[#This Row],[Reason not contacted]],Table1[[#This Row],[Reason not eligible]],Table1[[#This Row],[Reason not interested]],Table1[[#This Row],[Reason not enrolled]],Table1[[#This Row],[Reason first service not received]])","v":"No show"}]
[1443,null,"45 to 64 yrs","M","Non-Hispanic/Latino","White","Yes","Yes","No","Employed","2 to 6","MSK","Work related","Workers comp","Industry 3","Occupation 2","Workforce partner","Electronic Health Records","County B","Email",1,1,null,1,null,1,null,1,null,0,"No show","2019-09-05","2019-09-10","2019-09-19","2019-09-25",null,{"$f":"IF(Table1[[#This Row],[First service received]]=1,\"Never dropped\",IF(Table1[[#This Row],[Enrolled]]=1,\"No first service\",IF(Table1[[#This Row],[Expressed interest]]=1,\"Not enrolled\",IF(Table1[[#This Row],[Eligible]]=1,\"Not interested\",IF(Table1[[#This Row],[Contacted]]=1,\"Not eligible\",IF(Table1[[#This Row],[Identified]]=1,\"Not contacted\",\"\"))))))","v":"No first service"},{"$f":"_xlfn.CONCAT(Table1[[#This Row],[Reason not contacted]],Table1[[#This Row],[Reason not eligible]],Table1[[#This Row],[Reason not interested]],Table1[[#This Row],[Reason not enrolled]],Table1[[#This Row],[Reason first service not received]])","v":"No show"}]
[1490,null,"25 to 44 yrs","F","Non-Hispanic/Latino","White","Yes","Yes","No","Employed","7 to 12","MSK","Non-work related","Non-workers comp","Industry 3","Occupation 2","Health provider","Worker’s comp database","County A","In person",1,1,null,1,null,1,null,1,null,1,null,"2019-09-05","2019-09-17","2019-09-22","2019-10-08","2019-10-18",{"$f":"IF(Table1[[#This Row],[First service received]]=1,\"Never dropped\",IF(Table1[[#This Row],[Enrolled]]=1,\"No first service\",IF(Table1[[#This Row],[Expressed interest]]=1,\"Not enrolled\",IF(Table1[[#This Row],[Eligible]]=1,\"Not interested\",IF(Table1[[#This Row],[Contacted]]=1,\"Not eligible\",IF(Table1[[#This Row],[Identified]]=1,\"Not contacted\",\"\"))))))","v":"Never dropped"},{"$f":"_xlfn.CONCAT(Table1[[#This Row],[Reason not contacted]],Table1[[#This Row],[Reason not eligible]],Table1[[#This Row],[Reason not interested]],Table1[[#This Row],[Reason not enrolled]],Table1[[#This Row],[Reason first service not received]])","v":""}]
[1540,null,"25 to 44 yrs","F","Hispanic/Latino","White","Yes","No","No","Employed","2 to 6","MSK","Non-work related","Non-workers comp","Industry 1","Occupation 3","Self","Electronic Health Records","County C","Phone",1,1,null,1,null,1,null,1,null,1,null,"2019-09-05","2019-09-08","2019-09-18","2019-09-23","2019-10-06",{"$f":"IF(Table1[[#This Row],[First service received]]=1,\"Never dropped\",IF(Table1[[#This Row],[Enrolled]]=1,\"No first service\",IF(Table1[[#This Row],[Expressed interest]]=1,\"Not enrolled\",IF(Table1[[#This Row],[Eligible]]=1,\"Not interested\",IF(Table1[[#This Row],[Contacted]]=1,\"Not eligible\",IF(Table1[[#This Row],[Identified]]=1,\"Not contacted\",\"\"))))))","v":"Never dropped"},{"$f":"_xlfn.CONCAT(Table1[[#This Row],[Reason not contacted]],Table1[[#This Row],[Reason not eligible]],Table1[[#This Row],[Reason not interested]],Table1[[#This Row],[Reason not enrolled]],Table1[[#This Row],[Reason first service not received]])","v":""}]
[1100,null,"18 to 24 yrs","M","Non-Hispanic/Latino","American Indian or Alaska Native","No","Yes","No","Employed","2 to 6","MSK","Work related","Non-workers comp","Industry 4","Occupation 3","Health provider","Clinic appointment schedules","County A","Email",1,1,null,1,null,1,null,1,null,1,null,"2019-09-06","2019-09-15","2019-09-19","2019-10-03","2019-10-06",{"$f":"IF(Table1[[#This Row],[First service received]]=1,\"Never dropped\",IF(Table1[[#This Row],[Enrolled]]=1,\"No first service\",IF(Table1[[#This Row],[Expressed interest]]=1,\"Not enrolled\",IF(Table1[[#This Row],[Eligible]]=1,\"Not interested\",IF(Table1[[#This Row],[Contacted]]=1,\"Not eligible\",IF(Table1[[#This Row],[Identified]]=1,\"Not contacted\",\"\"))))))","v":"Never dropped"},{"$f":"_xlfn.CONCAT(Table1[[#This Row],[Reason not contacted]],Table1[[#This Row],[Reason not eligible]],Table1[[#This Row],[Reason not interested]],Table1[[#This Row],[Reason not enrolled]],Table1[[#This Row],[Reason first service not received]])","v":""}]
[1202,null,"18 to 24 yrs","M","Non-Hispanic/Latino","American Indian or Alaska Native","No","Yes","No","Employed","2 to 6","MSK","Work related","Non-workers comp","Industry 4","Occupation 3","Health provider","Clinic appointment schedules","County A","Email",1,1,null,1,null,1,null,1,null,1,null,"2019-09-06","2019-09-15","2019-09-19","2019-10-03","2019-10-06",{"$f":"IF(Table1[[#This Row],[First service received]]=1,\"Never dropped\",IF(Table1[[#This Row],[Enrolled]]=1,\"No first service\",IF(Table1[[#This Row],[Expressed interest]]=1,\"Not enrolled\",IF(Table1[[#This Row],[Eligible]]=1,\"Not interested\",IF(Table1[[#This Row],[Contacted]]=1,\"Not eligible\",IF(Table1[[#This Row],[Identified]]=1,\"Not contacted\",\"\"))))))","v":"Never dropped"},{"$f":"_xlfn.CONCAT(Table1[[#This Row],[Reason not contacted]],Table1[[#This Row],[Reason not eligible]],Table1[[#This Row],[Reason not interested]],Table1[[#This Row],[Reason not enrolled]],Table1[[#This Row],[Reason first service not received]])","v":""}]
[1241,null,"25 to 44 yrs","F","Non-Hispanic/Latino","Black or African-American","Yes","Yes","No","Employed","2 to 6","MSK","Non-work related","Non-workers comp","Industry 3","Occupation 2","Health provider","Work restriction forms","County A","Email",1,0,"Contacted, no response",0,null,0,null,0,null,0,null,"2019-09-06",null,null,null,null,{"$f":"IF(Table1[[#This Row],[First service received]]=1,\"Never dropped\",IF(Table1[[#This Row],[Enrolled]]=1,\"No first service\",IF(Table1[[#This Row],[Expressed interest]]=1,\"Not enrolled\",IF(Table1[[#This Row],[Eligible]]=1,\"Not interested\",IF(Table1[[#This Row],[Contacted]]=1,\"Not eligible\",IF(Table1[[#This Row],[Identified]]=1,\"Not contacted\",\"\"))))))","v":"Not contacted"},{"$f":"_xlfn.CONCAT(Table1[[#This Row],[Reason not contacted]],Table1[[#This Row],[Reason not eligible]],Table1[[#This Row],[Reason not interested]],Table1[[#This Row],[Reason not enrolled]],Table1[[#This Row],[Reason first service not received]])","v":"Contacted, no response"}]
[1299,null,"45 to 64 yrs","M","Non-Hispanic/Latino","White","Yes","Yes","No","Employed","13+ weeks","Other","Work related","Non-workers comp","Industry 3","Occupation 4","Health provider","Clinic appointment schedules","County B","Phone",1,1,null,1,null,1,null,1,null,1,null,"2019-09-06","2019-09-15","2019-09-25","2019-09-29","2019-10-12",{"$f":"IF(Table1[[#This Row],[First service received]]=1,\"Never dropped\",IF(Table1[[#This Row],[Enrolled]]=1,\"No first service\",IF(Table1[[#This Row],[Expressed interest]]=1,\"Not enrolled\",IF(Table1[[#This Row],[Eligible]]=1,\"Not interested\",IF(Table1[[#This Row],[Contacted]]=1,\"Not eligible\",IF(Table1[[#This Row],[Identified]]=1,\"Not contacted\",\"\"))))))","v":"Never dropped"},{"$f":"_xlfn.CONCAT(Table1[[#This Row],[Reason not contacted]],Table1[[#This Row],[Reason not eligible]],Table1[[#This Row],[Reason not interested]],Table1[[#This Row],[Reason not enrolled]],Table1[[#This Row],[Reason first service not received]])","v":""}]
[1409,null,"45 to 64 yrs","M","Non-Hispanic/Latino","White","Yes","Yes","No","Employed","13+ weeks","Other","Work related","Non-workers comp","Industry 3","Occupation 4","Health provider","Clinic appointment schedules","County B","Phone",1,1,null,1,null,1,null,1,null,1,null,"2019-09-06","2019-09-15","2019-09-25","2019-09-29","2019-10-12",{"$f":"IF(Table1[[#This Row],[First service received]]=1,\"Never dropped\",IF(Table1[[#This Row],[Enrolled]]=1,\"No first service\",IF(Table1[[#This Row],[Expressed interest]]=1,\"Not enrolled\",IF(Table1[[#This Row],[Eligible]]=1,\"Not interested\",IF(Table1[[#This Row],[Contacted]]=1,\"Not eligible\",IF(Table1[[#This Row],[Identified]]=1,\"Not contacted\",\"\"))))))","v":"Never dropped"},{"$f":"_xlfn.CONCAT(Table1[[#This Row],[Reason not contacted]],Table1[[#This Row],[Reason not eligible]],Table1[[#This Row],[Reason not interested]],Table1[[#This Row],[Reason not enrolled]],Table1[[#This Row],[Reason first service not received]])","v":""}]
[1471,null,"25 to 44 yrs","F","Hispanic/Latino","White","Yes","Yes","No","Not Employed","0 to 1","Cardio or Respiratory","Non-work related","Non-workers comp","Industry 1","Occupation 3","Health provider","FMLA forms","County B","Phone",1,1,null,1,null,0,"Impact on provider relationship",0,null,0,null,"2019-09-06","2019-09-12","2019-09-13",null,null,{"$f":"IF(Table1[[#This Row],[First service received]]=1,\"Never dropped\",IF(Table1[[#This Row],[Enrolled]]=1,\"No first service\",IF(Table1[[#This Row],[Expressed interest]]=1,\"Not enrolled\",IF(Table1[[#This Row],[Eligible]]=1,\"Not interested\",IF(Table1[[#This Row],[Contacted]]=1,\"Not eligible\",IF(Table1[[#This Row],[Identified]]=1,\"Not contacted\",\"\"))))))","v":"Not interested"},{"$f":"_xlfn.CONCAT(Table1[[#This Row],[Reason not contacted]],Table1[[#This Row],[Reason not eligible]],Table1[[#This Row],[Reason not interested]],Table1[[#This Row],[Reason not enrolled]],Table1[[#This Row],[Reason first service not received]])","v":"Impact on provider relationship"}]
[1486,null,"18 to 24 yrs","M","Non-Hispanic/Latino","American Indian or Alaska Native","No","Yes","No","Employed","2 to 6","MSK","Work related","Non-workers comp","Industry 4","Occupation 3","Health provider","Clinic appointment schedules","County A","Email",1,1,null,1,null,1,null,1,null,1,null,"2019-09-06","2019-09-15","2019-09-19","2019-10-03","2019-10-06",{"$f":"IF(Table1[[#This Row],[First service received]]=1,\"Never dropped\",IF(Table1[[#This Row],[Enrolled]]=1,\"No first service\",IF(Table1[[#This Row],[Expressed interest]]=1,\"Not enrolled\",IF(Table1[[#This Row],[Eligible]]=1,\"Not interested\",IF(Table1[[#This Row],[Contacted]]=1,\"Not eligible\",IF(Table1[[#This Row],[Identified]]=1,\"Not contacted\",\"\"))))))","v":"Never dropped"},{"$f":"_xlfn.CONCAT(Table1[[#This Row],[Reason not contacted]],Table1[[#This Row],[Reason not eligible]],Table1[[#This Row],[Reason not interested]],Table1[[#This Row],[Reason not enrolled]],Table1[[#This Row],[Reason first service not received]])","v":""}]
[1542,null,"45 to 64 yrs","M","Non-Hispanic/Latino","White","Yes","Yes","No","Employed","13+ weeks","Other","Work related","Non-workers comp","Industry 3","Occupation 4","Health provider","Clinic appointment schedules","County B","Phone",1,1,null,1,null,1,null,1,null,1,null,"2019-09-06","2019-09-15","2019-09-25","2019-09-29","2019-10-12",{"$f":"IF(Table1[[#This Row],[First service received]]=1,\"Never dropped\",IF(Table1[[#This Row],[Enrolled]]=1,\"No first service\",IF(Table1[[#This Row],[Expressed interest]]=1,\"Not enrolled\",IF(Table1[[#This Row],[Eligible]]=1,\"Not interested\",IF(Table1[[#This Row],[Contacted]]=1,\"Not eligible\",IF(Table1[[#This Row],[Identified]]=1,\"Not contacted\",\"\"))))))","v":"Never dropped"},{"$f":"_xlfn.CONCAT(Table1[[#This Row],[Reason not contacted]],Table1[[#This Row],[Reason not eligible]],Table1[[#This Row],[Reason not interested]],Table1[[#This Row],[Reason not enrolled]],Table1[[#This Row],[Reason first service not received]])","v":""}]
[1017,"lorem ipsum","25 to 44 yrs","M","Hispanic/Latino","White","Yes","Yes","No","Employed","7 to 12","MSK","Non-work related","Non-workers comp","Industry 3","Occupation 2","Health provider","Worker’s comp database","County B","Phone",1,1,null,1,null,1,null,1,null,1,null,"2019-09-07","2019-09-18","2019-09-27","2019-10-13","2019-10-15",{"$f":"IF(Table1[[#This Row],[First service received]]=1,\"Never dropped\",IF(Table1[[#This Row],[Enrolled]]=1,\"No first service\",IF(Table1[[#This Row],[Expressed interest]]=1,\"Not enrolled\",IF(Table1[[#This Row],[Eligible]]=1,\"Not interested\",IF(Table1[[#This Row],[Contacted]]=1,\"Not eligible\",IF(Table1[[#This Row],[Identified]]=1,\"Not contacted\",\"\"))))))","v":"Never dropped"},{"$f":"_xlfn.CONCAT(Table1[[#This Row],[Reason not contacted]],Table1[[#This Row],[Reason not eligible]],Table1[[#This Row],[Reason not interested]],Table1[[#This Row],[Reason not enrolled]],Table1[[#This Row],[Reason first service not received]])","v":""}]
[1018,null,"25 to 44 yrs","F","Non-Hispanic/Latino","Black or African-American","Yes","Yes","No","Employed","7 to 12","Cardio or Respiratory","Non-work related","Non-workers comp","Industry 4","Occupation 1","Workforce partner","Electronic Health Records","County B","Email",1,1,null,1,null,1,null,1,null,1,null,"2019-09-07","2019-09-14","2019-09-20","2019-10-01","2019-10-05",{"$f":"IF(Table1[[#This Row],[First service received]]=1,\"Never dropped\",IF(Table1[[#This Row],[Enrolled]]=1,\"No first service\",IF(Table1[[#This Row],[Expressed interest]]=1,\"Not enrolled\",IF(Table1[[#This Row],[Eligible]]=1,\"Not interested\",IF(Table1[[#This Row],[Contacted]]=1,\"Not eligible\",IF(Table1[[#This Row],[Identified]]=1,\"Not contacted\",\"\"))))))","v":"Never dropped"},{"$f":"_xlfn.CONCAT(Table1[[#This Row],[Reason not contacted]],Table1[[#This Row],[Reason not eligible]],Table1[[#This Row],[Reason not interested]],Table1[[#This Row],[Reason not enrolled]],Table1[[#This Row],[Reason first service not received]])","v":""}]
[1022,null,"25 to 44 yrs","F","Non-Hispanic/Latino","White","Yes","Yes","No","Employed","2 to 6","MSK","Non-work related","Non-workers comp","Industry 3","Occupation 2","Employer","Electronic Health Records","County B","Phone",1,1,null,1,null,1,null,1,null,1,null,"2019-09-07","2019-09-22","2019-10-01","2019-10-12","2019-10-13",{"$f":"IF(Table1[[#This Row],[First service received]]=1,\"Never dropped\",IF(Table1[[#This Row],[Enrolled]]=1,\"No first service\",IF(Table1[[#This Row],[Expressed interest]]=1,\"Not enrolled\",IF(Table1[[#This Row],[Eligible]]=1,\"Not interested\",IF(Table1[[#This Row],[Contacted]]=1,\"Not eligible\",IF(Table1[[#This Row],[Identified]]=1,\"Not contacted\",\"\"))))))","v":"Never dropped"},{"$f":"_xlfn.CONCAT(Table1[[#This Row],[Reason not contacted]],Table1[[#This Row],[Reason not eligible]],Table1[[#This Row],[Reason not interested]],Table1[[#This Row],[Reason not enrolled]],Table1[[#This Row],[Reason first service not received]])","v":""}]
[1027,null,"25 to 44 yrs","F","Non-Hispanic/Latino","White","Yes","Yes","No","Employed","2 to 6","MSK","Non-work related","Non-workers comp","Industry 3","Occupation 2","Employer","Electronic Health Records","County B","Phone",1,1,null,1,null,1,null,1,null,1,null,"2019-09-07","2019-09-22","2019-10-01","2019-10-12","2019-10-13",{"$f":"IF(Table1[[#This Row],[First service received]]=1,\"Never dropped\",IF(Table1[[#This Row],[Enrolled]]=1,\"No first service\",IF(Table1[[#This Row],[Expressed interest]]=1,\"Not enrolled\",IF(Table1[[#This Row],[Eligible]]=1,\"Not interested\",IF(Table1[[#This Row],[Contacted]]=1,\"Not eligible\",IF(Table1[[#This Row],[Identified]]=1,\"Not contacted\",\"\"))))))","v":"Never dropped"},{"$f":"_xlfn.CONCAT(Table1[[#This Row],[Reason not contacted]],Table1[[#This Row],[Reason not eligible]],Table1[[#This Row],[Reason not interested]],Table1[[#This Row],[Reason not enrolled]],Table1[[#This Row],[Reason first service not received]])","v":""}]
[1041,null,"25 to 44 yrs","M","Non-Hispanic/Latino","White","Yes","Yes","No","Employed","13+ weeks","Other","Non-work related","Non-workers comp","Industry 3","Occupation 2","Health provider","Voc rehab centers","County B","In person",1,1,null,0,"Ineligible reason2",0,null,0,null,0,null,"2019-09-07","2019-09-10","2019-09-22",null,null,{"$f":"IF(Table1[[#This Row],[First service received]]=1,\"Never dropped\",IF(Table1[[#This Row],[Enrolled]]=1,\"No first service\",IF(Table1[[#This Row],[Expressed interest]]=1,\"Not enrolled\",IF(Table1[[#This Row],[Eligible]]=1,\"Not interested\",IF(Table1[[#This Row],[Contacted]]=1,\"Not eligible\",IF(Table1[[#This Row],[Identified]]=1,\"Not contacted\",\"\"))))))","v":"Not eligible"},{"$f":"_xlfn.CONCAT(Table1[[#This Row],[Reason not contacted]],Table1[[#This Row],[Reason not eligible]],Table1[[#This Row],[Reason not interested]],Table1[[#This Row],[Reason not enrolled]],Table1[[#This Row],[Reason first service not received]])","v":"Ineligible reason2"}]
[1123,null,"25 to 44 yrs","M","Hispanic/Latino","White","No","Yes","No","Employed","2 to 6","Cardio or Respiratory","Work related","Non-workers comp","Industry 1","Occupation 4","Employer","Electronic Health Records","County B","Phone",1,1,null,1,null,1,null,1,null,1,null,"2019-09-07","2019-09-22","2019-09-25","2019-10-13","2019-10-15",{"$f":"IF(Table1[[#This Row],[First service received]]=1,\"Never dropped\",IF(Table1[[#This Row],[Enrolled]]=1,\"No first service\",IF(Table1[[#This Row],[Expressed interest]]=1,\"Not enrolled\",IF(Table1[[#This Row],[Eligible]]=1,\"Not interested\",IF(Table1[[#This Row],[Contacted]]=1,\"Not eligible\",IF(Table1[[#This Row],[Identified]]=1,\"Not contacted\",\"\"))))))","v":"Never dropped"},{"$f":"_xlfn.CONCAT(Table1[[#This Row],[Reason not contacted]],Table1[[#This Row],[Reason not eligible]],Table1[[#This Row],[Reason not interested]],Table1[[#This Row],[Reason not enrolled]],Table1[[#This Row],[Reason first service not received]])","v":""}]
[1232,null,"25 to 44 yrs","M","Hispanic/Latino","White","No","Yes","No","Employed","2 to 6","Cardio or Respiratory","Work related","Non-workers comp","Industry 1","Occupation 4","Employer","Electronic Health Records","County B","Phone",1,1,null,1,null,1,null,1,null,1,null,"2019-09-07","2019-09-22","2019-09-25","2019-10-13","2019-10-15",{"$f":"IF(Table1[[#This Row],[First service received]]=1,\"Never dropped\",IF(Table1[[#This Row],[Enrolled]]=1,\"No first service\",IF(Table1[[#This Row],[Expressed interest]]=1,\"Not enrolled\",IF(Table1[[#This Row],[Eligible]]=1,\"Not interested\",IF(Table1[[#This Row],[Contacted]]=1,\"Not eligible\",IF(Table1[[#This Row],[Identified]]=1,\"Not contacted\",\"\"))))))","v":"Never dropped"},{"$f":"_xlfn.CONCAT(Table1[[#This Row],[Reason not contacted]],Table1[[#This Row],[Reason not eligible]],Table1[[#This Row],[Reason not interested]],Table1[[#This Row],[Reason not enrolled]],Table1[[#This Row],[Reason first service not received]])","v":""}]
[1290,null,"45 to 64 yrs","F","Non-Hispanic/Latino","Other or 2 or more","Yes","Yes","No","Not Employed","0 to 1","MSK","Non-work related","Non-workers comp","Industry 1","Occupation 1","Health provider","Voc rehab centers","County B","Email",1,1,null,1,null,1,null,0,"Not enrolled reason1",0,null,"2019-09-07","2019-09-08","2019-10-02",null,null,{"$f":"IF(Table1[[#This Row],[First service received]]=1,\"Never dropped\",IF(Table1[[#This Row],[Enrolled]]=1,\"No first service\",IF(Table1[[#This Row],[Expressed interest]]=1,\"Not enrolled\",IF(Table1[[#This Row],[Eligible]]=1,\"Not interested\",IF(Table1[[#This Row],[Contacted]]=1,\"Not eligible\",IF(Table1[[#This Row],[Identified]]=1,\"Not contacted\",\"\"))))))","v":"Not enrolled"},{"$f":"_xlfn.CONCAT(Table1[[#This Row],[Reason not contacted]],Table1[[#This Row],[Reason not eligible]],Table1[[#This Row],[Reason not interested]],Table1[[#This Row],[Reason not enrolled]],Table1[[#This Row],[Reason first service not received]])","v":"Not enrolled reason1"}]
[1328,null,"25 to 44 yrs","F","Non-Hispanic/Latino","White","Yes","Yes","No","Employed","13+ weeks","Cardio or Respiratory","Non-work related","Non-workers comp","Industry 4","Occupation 1","Health provider","Work restriction forms","County B","Email",1,1,null,0,"Ineligible reason3",0,null,0,null,0,null,"2019-09-07","2019-09-19","2019-10-11",null,null,{"$f":"IF(Table1[[#This Row],[First service received]]=1,\"Never dropped\",IF(Table1[[#This Row],[Enrolled]]=1,\"No first service\",IF(Table1[[#This Row],[Expressed interest]]=1,\"Not enrolled\",IF(Table1[[#This Row],[Eligible]]=1,\"Not interested\",IF(Table1[[#This Row],[Contacted]]=1,\"Not eligible\",IF(Table1[[#This Row],[Identified]]=1,\"Not contacted\",\"\"))))))","v":"Not eligible"},{"$f":"_xlfn.CONCAT(Table1[[#This Row],[Reason not contacted]],Table1[[#This Row],[Reason not eligible]],Table1[[#This Row],[Reason not interested]],Table1[[#This Row],[Reason not enrolled]],Table1[[#This Row],[Reason first service not received]])","v":"Ineligible reason3"}]
[1421,null,"25 to 44 yrs","M","Hispanic/Latino","White","No","Yes","No","Employed","2 to 6","Cardio or Respiratory","Work related","Non-workers comp","Industry 1","Occupation 4","Employer","Electronic Health Records","County B","Phone",1,1,null,1,null,1,null,1,null,1,null,"2019-09-07","2019-09-22","2019-09-25","2019-10-13","2019-10-15",{"$f":"IF(Table1[[#This Row],[First service received]]=1,\"Never dropped\",IF(Table1[[#This Row],[Enrolled]]=1,\"No first service\",IF(Table1[[#This Row],[Expressed interest]]=1,\"Not enrolled\",IF(Table1[[#This Row],[Eligible]]=1,\"Not interested\",IF(Table1[[#This Row],[Contacted]]=1,\"Not eligible\",IF(Table1[[#This Row],[Identified]]=1,\"Not contacted\",\"\"))))))","v":"Never dropped"},{"$f":"_xlfn.CONCAT(Table1[[#This Row],[Reason not contacted]],Table1[[#This Row],[Reason not eligible]],Table1[[#This Row],[Reason not interested]],Table1[[#This Row],[Reason not enrolled]],Table1[[#This Row],[Reason first service not received]])","v":""}]
[1424,null,"25 to 44 yrs","F","Non-Hispanic/Latino","Black or African-American","Yes","Yes","No","Employed","7 to 12","Cardio or Respiratory","Non-work related","Non-workers comp","Industry 4","Occupation 1","Workforce partner","Electronic Health Records","County B","Email",1,1,null,1,null,1,null,1,null,1,null,"2019-09-07","2019-09-14","2019-09-20","2019-10-01","2019-10-05",{"$f":"IF(Table1[[#This Row],[First service received]]=1,\"Never dropped\",IF(Table1[[#This Row],[Enrolled]]=1,\"No first service\",IF(Table1[[#This Row],[Expressed interest]]=1,\"Not enrolled\",IF(Table1[[#This Row],[Eligible]]=1,\"Not interested\",IF(Table1[[#This Row],[Contacted]]=1,\"Not eligible\",IF(Table1[[#This Row],[Identified]]=1,\"Not contacted\",\"\"))))))","v":"Never dropped"},{"$f":"_xlfn.CONCAT(Table1[[#This Row],[Reason not contacted]],Table1[[#This Row],[Reason not eligible]],Table1[[#This Row],[Reason not interested]],Table1[[#This Row],[Reason not enrolled]],Table1[[#This Row],[Reason first service not received]])","v":""}]
[1491,null,"25 to 44 yrs","F","Non-Hispanic/Latino","Black or African-American","Yes","Yes","No","Employed","7 to 12","Cardio or Respiratory","Non-work related","Non-workers comp","Industry 4","Occupation 1","Workforce partner","Electronic Health Records","County B","Email",1,1,null,1,null,1,null,1,null,1,null,"2019-09-07","2019-09-14","2019-09-20","2019-10-01","2019-10-05",{"$f":"IF(Table1[[#This Row],[First service received]]=1,\"Never dropped\",IF(Table1[[#This Row],[Enrolled]]=1,\"No first service\",IF(Table1[[#This Row],[Expressed interest]]=1,\"Not enrolled\",IF(Table1[[#This Row],[Eligible]]=1,\"Not interested\",IF(Table1[[#This Row],[Contacted]]=1,\"Not eligible\",IF(Table1[[#This Row],[Identified]]=1,\"Not contacted\",\"\"))))))","v":"Never dropped"},{"$f":"_xlfn.CONCAT(Table1[[#This Row],[Reason not contacted]],Table1[[#This Row],[Reason not eligible]],Table1[[#This Row],[Reason not interested]],Table1[[#This Row],[Reason not enrolled]],Table1[[#This Row],[Reason first service not received]])","v":""}]
[1516,null,"25 to 44 yrs","M","Hispanic/Latino","White","Yes","Yes","No","Employed","7 to 12","MSK","Non-work related","Non-workers comp","Industry 3","Occupation 2","Health provider","Worker’s comp database","County B","Phone",1,1,null,1,null,1,null,1,null,1,null,"2019-09-07","2019-09-18","2019-09-27","2019-10-13","2019-10-15",{"$f":"IF(Table1[[#This Row],[First service received]]=1,\"Never dropped\",IF(Table1[[#This Row],[Enrolled]]=1,\"No first service\",IF(Table1[[#This Row],[Expressed interest]]=1,\"Not enrolled\",IF(Table1[[#This Row],[Eligible]]=1,\"Not interested\",IF(Table1[[#This Row],[Contacted]]=1,\"Not eligible\",IF(Table1[[#This Row],[Identified]]=1,\"Not contacted\",\"\"))))))","v":"Never dropped"},{"$f":"_xlfn.CONCAT(Table1[[#This Row],[Reason not contacted]],Table1[[#This Row],[Reason not eligible]],Table1[[#This Row],[Reason not interested]],Table1[[#This Row],[Reason not enrolled]],Table1[[#This Row],[Reason first service not received]])","v":""}]
[1581,null,"25 to 44 yrs","F","Non-Hispanic/Latino","White","Yes","Yes","No","Employed","2 to 6","MSK","Non-work related","Non-workers comp","Industry 3","Occupation 2","Employer","Electronic Health Records","County B","Phone",1,1,null,1,null,1,null,1,null,1,null,"2019-09-07","2019-09-22","2019-10-01","2019-10-12","2019-10-13",{"$f":"IF(Table1[[#This Row],[First service received]]=1,\"Never dropped\",IF(Table1[[#This Row],[Enrolled]]=1,\"No first service\",IF(Table1[[#This Row],[Expressed interest]]=1,\"Not enrolled\",IF(Table1[[#This Row],[Eligible]]=1,\"Not interested\",IF(Table1[[#This Row],[Contacted]]=1,\"Not eligible\",IF(Table1[[#This Row],[Identified]]=1,\"Not contacted\",\"\"))))))","v":"Never dropped"},{"$f":"_xlfn.CONCAT(Table1[[#This Row],[Reason not contacted]],Table1[[#This Row],[Reason not eligible]],Table1[[#This Row],[Reason not interested]],Table1[[#This Row],[Reason not enrolled]],Table1[[#This Row],[Reason first service not received]])","v":""}]
[1598,null,"25 to 44 yrs","M","Hispanic/Latino","White","Yes","Yes","No","Employed","7 to 12","MSK","Non-work related","Non-workers comp","Industry 3","Occupation 2","Health provider","Worker’s comp database","County B","Phone",1,1,null,1,null,1,null,1,null,1,null,"2019-09-07","2019-09-18","2019-09-27","2019-10-13","2019-10-15",{"$f":"IF(Table1[[#This Row],[First service received]]=1,\"Never dropped\",IF(Table1[[#This Row],[Enrolled]]=1,\"No first service\",IF(Table1[[#This Row],[Expressed interest]]=1,\"Not enrolled\",IF(Table1[[#This Row],[Eligible]]=1,\"Not interested\",IF(Table1[[#This Row],[Contacted]]=1,\"Not eligible\",IF(Table1[[#This Row],[Identified]]=1,\"Not contacted\",\"\"))))))","v":"Never dropped"},{"$f":"_xlfn.CONCAT(Table1[[#This Row],[Reason not contacted]],Table1[[#This Row],[Reason not eligible]],Table1[[#This Row],[Reason not interested]],Table1[[#This Row],[Reason not enrolled]],Table1[[#This Row],[Reason first service not received]])","v":""}]
[1068,null,"45 to 64 yrs","M","Non-Hispanic/Latino","White","Yes","Yes","No","Employed","2 to 6","MSK","Non-work related","Non-workers comp","Industry 1","Occupation 4","Health provider","FMLA forms","County B","In person",1,1,null,1,null,1,null,1,null,1,null,"2019-09-08","2019-09-10","2019-09-13","2019-10-03","2019-10-07",{"$f":"IF(Table1[[#This Row],[First service received]]=1,\"Never dropped\",IF(Table1[[#This Row],[Enrolled]]=1,\"No first service\",IF(Table1[[#This Row],[Expressed interest]]=1,\"Not enrolled\",IF(Table1[[#This Row],[Eligible]]=1,\"Not interested\",IF(Table1[[#This Row],[Contacted]]=1,\"Not eligible\",IF(Table1[[#This Row],[Identified]]=1,\"Not contacted\",\"\"))))))","v":"Never dropped"},{"$f":"_xlfn.CONCAT(Table1[[#This Row],[Reason not contacted]],Table1[[#This Row],[Reason not eligible]],Table1[[#This Row],[Reason not interested]],Table1[[#This Row],[Reason not enrolled]],Table1[[#This Row],[Reason first service not received]])","v":""}]
[1122,null,"45 to 64 yrs","M","Non-Hispanic/Latino","White","Yes","Yes","No","Employed","2 to 6","MSK","Non-work related","Non-workers comp","Industry 1","Occupation 4","Health provider","FMLA forms","County B","In person",1,1,null,1,null,1,null,1,null,1,null,"2019-09-08","2019-09-10","2019-09-13","2019-10-03","2019-10-07",{"$f":"IF(Table1[[#This Row],[First service received]]=1,\"Never dropped\",IF(Table1[[#This Row],[Enrolled]]=1,\"No first service\",IF(Table1[[#This Row],[Expressed interest]]=1,\"Not enrolled\",IF(Table1[[#This Row],[Eligible]]=1,\"Not interested\",IF(Table1[[#This Row],[Contacted]]=1,\"Not eligible\",IF(Table1[[#This Row],[Identified]]=1,\"Not contacted\",\"\"))))))","v":"Never dropped"},{"$f":"_xlfn.CONCAT(Table1[[#This Row],[Reason not contacted]],Table1[[#This Row],[Reason not eligible]],Table1[[#This Row],[Reason not interested]],Table1[[#This Row],[Reason not enrolled]],Table1[[#This Row],[Reason first service not received]])","v":""}]
[1435,null,"45 to 64 yrs","M","Non-Hispanic/Latino","White","No","Yes","No","Employed","2 to 6","MSK","Non-work related","Non-workers comp","Industry 1","Occupation 1","Workforce partner","Electronic Health Records","County B","In person",1,1,null,0,"Ineligible reason1",0,null,0,null,0,null,"2019-09-08","2019-09-21","2019-10-05",null,null,{"$f":"IF(Table1[[#This Row],[First service received]]=1,\"Never dropped\",IF(Table1[[#This Row],[Enrolled]]=1,\"No first service\",IF(Table1[[#This Row],[Expressed interest]]=1,\"Not enrolled\",IF(Table1[[#This Row],[Eligible]]=1,\"Not interested\",IF(Table1[[#This Row],[Contacted]]=1,\"Not eligible\",IF(Table1[[#This Row],[Identified]]=1,\"Not contacted\",\"\"))))))","v":"Not eligible"},{"$f":"_xlfn.CONCAT(Table1[[#This Row],[Reason not contacted]],Table1[[#This Row],[Reason not eligible]],Table1[[#This Row],[Reason not interested]],Table1[[#This Row],[Reason not enrolled]],Table1[[#This Row],[Reason first service not received]])","v":"Ineligible reason1"}]
[1445,null,"45 to 64 yrs","M","Non-Hispanic/Latino","White","Yes","Yes","No","Employed","2 to 6","MSK","Non-work related","Non-workers comp","Industry 1","Occupation 4","Health provider","FMLA forms","County B","In person",1,1,null,1,null,1,null,1,null,1,null,"2019-09-08","2019-09-10","2019-09-13","2019-10-03","2019-10-07",{"$f":"IF(Table1[[#This Row],[First service received]]=1,\"Never dropped\",IF(Table1[[#This Row],[Enrolled]]=1,\"No first service\",IF(Table1[[#This Row],[Expressed interest]]=1,\"Not enrolled\",IF(Table1[[#This Row],[Eligible]]=1,\"Not interested\",IF(Table1[[#This Row],[Contacted]]=1,\"Not eligible\",IF(Table1[[#This Row],[Identified]]=1,\"Not contacted\",\"\"))))))","v":"Never dropped"},{"$f":"_xlfn.CONCAT(Table1[[#This Row],[Reason not contacted]],Table1[[#This Row],[Reason not eligible]],Table1[[#This Row],[Reason not interested]],Table1[[#This Row],[Reason not enrolled]],Table1[[#This Row],[Reason first service not received]])","v":""}]
[1496,null,"45 to 64 yrs","F","Non-Hispanic/Latino","White","Yes","Yes","No","Employed","0 to 1","Other","Non-work related","Non-workers comp","Industry 3","Occupation 2","Health provider","Worker’s comp database","County B","Phone",1,1,null,1,null,0,"Don't want to be in research study",0,null,0,null,"2019-09-08","2019-09-18","2019-10-22",null,null,{"$f":"IF(Table1[[#This Row],[First service received]]=1,\"Never dropped\",IF(Table1[[#This Row],[Enrolled]]=1,\"No first service\",IF(Table1[[#This Row],[Expressed interest]]=1,\"Not enrolled\",IF(Table1[[#This Row],[Eligible]]=1,\"Not interested\",IF(Table1[[#This Row],[Contacted]]=1,\"Not eligible\",IF(Table1[[#This Row],[Identified]]=1,\"Not contacted\",\"\"))))))","v":"Not interested"},{"$f":"_xlfn.CONCAT(Table1[[#This Row],[Reason not contacted]],Table1[[#This Row],[Reason not eligible]],Table1[[#This Row],[Reason not interested]],Table1[[#This Row],[Reason not enrolled]],Table1[[#This Row],[Reason first service not received]])","v":"Don't want to be in research study"}]
[1260,null,"25 to 44 yrs","M","Non-Hispanic/Latino","White","Yes","Yes","No","Employed","7 to 12","MSK","Work related","Workers comp","Industry 3","Occupation 2","Employer","Electronic Health Records","County B","In person",1,1,null,0,"Ineligible reason1",0,null,0,null,0,null,"2019-09-10","2019-09-18","2019-10-14",null,null,{"$f":"IF(Table1[[#This Row],[First service received]]=1,\"Never dropped\",IF(Table1[[#This Row],[Enrolled]]=1,\"No first service\",IF(Table1[[#This Row],[Expressed interest]]=1,\"Not enrolled\",IF(Table1[[#This Row],[Eligible]]=1,\"Not interested\",IF(Table1[[#This Row],[Contacted]]=1,\"Not eligible\",IF(Table1[[#This Row],[Identified]]=1,\"Not contacted\",\"\"))))))","v":"Not eligible"},{"$f":"_xlfn.CONCAT(Table1[[#This Row],[Reason not contacted]],Table1[[#This Row],[Reason not eligible]],Table1[[#This Row],[Reason not interested]],Table1[[#This Row],[Reason not enrolled]],Table1[[#This Row],[Reason first service not received]])","v":"Ineligible reason1"}]
[1111,null,"25 to 44 yrs","M","Non-Hispanic/Latino","Black or African-American","Yes","Yes","No","Employed","7 to 12","MSK","Work related","Non-workers comp","Industry 3","Occupation 1","Employer","Electronic Health Records","County B","Phone",1,1,null,1,null,0,"Impact on provider relationship",0,null,0,null,"2019-09-11","2019-09-25","2019-09-30",null,null,{"$f":"IF(Table1[[#This Row],[First service received]]=1,\"Never dropped\",IF(Table1[[#This Row],[Enrolled]]=1,\"No first service\",IF(Table1[[#This Row],[Expressed interest]]=1,\"Not enrolled\",IF(Table1[[#This Row],[Eligible]]=1,\"Not interested\",IF(Table1[[#This Row],[Contacted]]=1,\"Not eligible\",IF(Table1[[#This Row],[Identified]]=1,\"Not contacted\",\"\"))))))","v":"Not interested"},{"$f":"_xlfn.CONCAT(Table1[[#This Row],[Reason not contacted]],Table1[[#This Row],[Reason not eligible]],Table1[[#This Row],[Reason not interested]],Table1[[#This Row],[Reason not enrolled]],Table1[[#This Row],[Reason first service not received]])","v":"Impact on provider relationship"}]
[1174,null,"45 to 64 yrs","M","Non-Hispanic/Latino","American Indian or Alaska Native","Yes","Yes","No","Employed","0 to 1","Other","Non-work related","Non-workers comp","Industry 4","Occupation 3","Workforce partner","Electronic Health Records","County B","Email",1,1,null,1,null,1,null,1,null,1,null,"2019-09-11","2019-09-13","2019-09-18","2019-10-04","2019-10-08",{"$f":"IF(Table1[[#This Row],[First service received]]=1,\"Never dropped\",IF(Table1[[#This Row],[Enrolled]]=1,\"No first service\",IF(Table1[[#This Row],[Expressed interest]]=1,\"Not enrolled\",IF(Table1[[#This Row],[Eligible]]=1,\"Not interested\",IF(Table1[[#This Row],[Contacted]]=1,\"Not eligible\",IF(Table1[[#This Row],[Identified]]=1,\"Not contacted\",\"\"))))))","v":"Never dropped"},{"$f":"_xlfn.CONCAT(Table1[[#This Row],[Reason not contacted]],Table1[[#This Row],[Reason not eligible]],Table1[[#This Row],[Reason not interested]],Table1[[#This Row],[Reason not enrolled]],Table1[[#This Row],[Reason first service not received]])","v":""}]
[1278,null,"45 to 64 yrs","M","Non-Hispanic/Latino","American Indian or Alaska Native","Yes","Yes","No","Employed","0 to 1","Other","Non-work related","Non-workers comp","Industry 4","Occupation 3","Workforce partner","Electronic Health Records","County B","Email",1,1,null,1,null,1,null,1,null,1,null,"2019-09-11","2019-09-13","2019-09-18","2019-10-04","2019-10-08",{"$f":"IF(Table1[[#This Row],[First service received]]=1,\"Never dropped\",IF(Table1[[#This Row],[Enrolled]]=1,\"No first service\",IF(Table1[[#This Row],[Expressed interest]]=1,\"Not enrolled\",IF(Table1[[#This Row],[Eligible]]=1,\"Not interested\",IF(Table1[[#This Row],[Contacted]]=1,\"Not eligible\",IF(Table1[[#This Row],[Identified]]=1,\"Not contacted\",\"\"))))))","v":"Never dropped"},{"$f":"_xlfn.CONCAT(Table1[[#This Row],[Reason not contacted]],Table1[[#This Row],[Reason not eligible]],Table1[[#This Row],[Reason not interested]],Table1[[#This Row],[Reason not enrolled]],Table1[[#This Row],[Reason first service not received]])","v":""}]
[1387,null,"45 to 64 yrs","F","Non-Hispanic/Latino","White","Yes","No","No","Employed","0 to 1","MSK","Work related","Workers comp","Industry 4","Occupation 3","Health provider","Clinic appointment schedules","County B","Email",1,1,null,1,null,0,"Don't want to be in research study",0,null,0,null,"2019-09-11","2019-09-22","2019-11-02",null,null,{"$f":"IF(Table1[[#This Row],[First service received]]=1,\"Never dropped\",IF(Table1[[#This Row],[Enrolled]]=1,\"No first service\",IF(Table1[[#This Row],[Expressed interest]]=1,\"Not enrolled\",IF(Table1[[#This Row],[Eligible]]=1,\"Not interested\",IF(Table1[[#This Row],[Contacted]]=1,\"Not eligible\",IF(Table1[[#This Row],[Identified]]=1,\"Not contacted\",\"\"))))))","v":"Not interested"},{"$f":"_xlfn.CONCAT(Table1[[#This Row],[Reason not contacted]],Table1[[#This Row],[Reason not eligible]],Table1[[#This Row],[Reason not interested]],Table1[[#This Row],[Reason not enrolled]],Table1[[#This Row],[Reason first service not received]])","v":"Don't want to be in research study"}]
[1426,null,"45 to 64 yrs","M","Non-Hispanic/Latino","American Indian or Alaska Native","Yes","Yes","No","Employed","0 to 1","Other","Non-work related","Non-workers comp","Industry 4","Occupation 3","Workforce partner","Electronic Health Records","County B","Email",1,1,null,1,null,1,null,1,null,1,null,"2019-09-11","2019-09-13","2019-09-18","2019-10-04","2019-10-08",{"$f":"IF(Table1[[#This Row],[First service received]]=1,\"Never dropped\",IF(Table1[[#This Row],[Enrolled]]=1,\"No first service\",IF(Table1[[#This Row],[Expressed interest]]=1,\"Not enrolled\",IF(Table1[[#This Row],[Eligible]]=1,\"Not interested\",IF(Table1[[#This Row],[Contacted]]=1,\"Not eligible\",IF(Table1[[#This Row],[Identified]]=1,\"Not contacted\",\"\"))))))","v":"Never dropped"},{"$f":"_xlfn.CONCAT(Table1[[#This Row],[Reason not contacted]],Table1[[#This Row],[Reason not eligible]],Table1[[#This Row],[Reason not interested]],Table1[[#This Row],[Reason not enrolled]],Table1[[#This Row],[Reason first service not received]])","v":""}]
[1580,null,"45 to 64 yrs","M","Non-Hispanic/Latino","White","No","Yes","No","Not Employed","0 to 1","MSK","Work related","Workers comp","Industry 3","Occupation 2","Health provider","Worker’s comp database","County C","Email",1,0,"Contacted, no response",0,null,0,null,0,null,0,null,"2019-09-11",null,null,null,null,{"$f":"IF(Table1[[#This Row],[First service received]]=1,\"Never dropped\",IF(Table1[[#This Row],[Enrolled]]=1,\"No first service\",IF(Table1[[#This Row],[Expressed interest]]=1,\"Not enrolled\",IF(Table1[[#This Row],[Eligible]]=1,\"Not interested\",IF(Table1[[#This Row],[Contacted]]=1,\"Not eligible\",IF(Table1[[#This Row],[Identified]]=1,\"Not contacted\",\"\"))))))","v":"Not contacted"},{"$f":"_xlfn.CONCAT(Table1[[#This Row],[Reason not contacted]],Table1[[#This Row],[Reason not eligible]],Table1[[#This Row],[Reason not interested]],Table1[[#This Row],[Reason not enrolled]],Table1[[#This Row],[Reason first service not received]])","v":"Contacted, no response"}]
[1190,null,"25 to 44 yrs","M","Hispanic/Latino","White","Yes","Yes","No","Not Employed","0 to 1","MSK","Non-work related","Non-workers comp","Industry 3","Occupation 2","Employer","Electronic Health Records","County B","Phone",1,1,null,1,null,1,null,1,null,1,null,"2019-09-12","2019-09-13","2019-09-15","2019-10-09","2019-10-14",{"$f":"IF(Table1[[#This Row],[First service received]]=1,\"Never dropped\",IF(Table1[[#This Row],[Enrolled]]=1,\"No first service\",IF(Table1[[#This Row],[Expressed interest]]=1,\"Not enrolled\",IF(Table1[[#This Row],[Eligible]]=1,\"Not interested\",IF(Table1[[#This Row],[Contacted]]=1,\"Not eligible\",IF(Table1[[#This Row],[Identified]]=1,\"Not contacted\",\"\"))))))","v":"Never dropped"},{"$f":"_xlfn.CONCAT(Table1[[#This Row],[Reason not contacted]],Table1[[#This Row],[Reason not eligible]],Table1[[#This Row],[Reason not interested]],Table1[[#This Row],[Reason not enrolled]],Table1[[#This Row],[Reason first service not received]])","v":""}]
[1236,null,"25 to 44 yrs","M","Hispanic/Latino","White","Yes","Yes","No","Not Employed","0 to 1","MSK","Non-work related","Non-workers comp","Industry 3","Occupation 2","Employer","Electronic Health Records","County B","Phone",1,1,null,1,null,1,null,1,null,1,null,"2019-09-12","2019-09-13","2019-09-15","2019-10-09","2019-10-14",{"$f":"IF(Table1[[#This Row],[First service received]]=1,\"Never dropped\",IF(Table1[[#This Row],[Enrolled]]=1,\"No first service\",IF(Table1[[#This Row],[Expressed interest]]=1,\"Not enrolled\",IF(Table1[[#This Row],[Eligible]]=1,\"Not interested\",IF(Table1[[#This Row],[Contacted]]=1,\"Not eligible\",IF(Table1[[#This Row],[Identified]]=1,\"Not contacted\",\"\"))))))","v":"Never dropped"},{"$f":"_xlfn.CONCAT(Table1[[#This Row],[Reason not contacted]],Table1[[#This Row],[Reason not eligible]],Table1[[#This Row],[Reason not interested]],Table1[[#This Row],[Reason not enrolled]],Table1[[#This Row],[Reason first service not received]])","v":""}]
[1238,null,"25 to 44 yrs","M","Hispanic/Latino","White","Yes","Yes","No","Not Employed","0 to 1","MSK","Non-work related","Non-workers comp","Industry 3","Occupation 2","Employer","Electronic Health Records","County B","Phone",1,1,null,1,null,1,null,1,null,1,null,"2019-09-12","2019-09-13","2019-09-15","2019-10-09","2019-10-14",{"$f":"IF(Table1[[#This Row],[First service received]]=1,\"Never dropped\",IF(Table1[[#This Row],[Enrolled]]=1,\"No first service\",IF(Table1[[#This Row],[Expressed interest]]=1,\"Not enrolled\",IF(Table1[[#This Row],[Eligible]]=1,\"Not interested\",IF(Table1[[#This Row],[Contacted]]=1,\"Not eligible\",IF(Table1[[#This Row],[Identified]]=1,\"Not contacted\",\"\"))))))","v":"Never dropped"},{"$f":"_xlfn.CONCAT(Table1[[#This Row],[Reason not contacted]],Table1[[#This Row],[Reason not eligible]],Table1[[#This Row],[Reason not interested]],Table1[[#This Row],[Reason not enrolled]],Table1[[#This Row],[Reason first service not received]])","v":""}]
[1352,null,"25 to 44 yrs","M","Non-Hispanic/Latino","White","Yes","Yes","No","Employed","2 to 6","MSK","Non-work related","Non-workers comp","Industry 3","Occupation 2","Health provider","FMLA forms","County C","In person",1,1,null,1,null,0,"Not interested reason3",0,null,0,null,"2019-09-12","2019-09-25","2019-10-30",null,null,{"$f":"IF(Table1[[#This Row],[First service received]]=1,\"Never dropped\",IF(Table1[[#This Row],[Enrolled]]=1,\"No first service\",IF(Table1[[#This Row],[Expressed interest]]=1,\"Not enrolled\",IF(Table1[[#This Row],[Eligible]]=1,\"Not interested\",IF(Table1[[#This Row],[Contacted]]=1,\"Not eligible\",IF(Table1[[#This Row],[Identified]]=1,\"Not contacted\",\"\"))))))","v":"Not interested"},{"$f":"_xlfn.CONCAT(Table1[[#This Row],[Reason not contacted]],Table1[[#This Row],[Reason not eligible]],Table1[[#This Row],[Reason not interested]],Table1[[#This Row],[Reason not enrolled]],Table1[[#This Row],[Reason first service not received]])","v":"Not interested reason3"}]
[1505,null,"18 to 24 yrs","F","Non-Hispanic/Latino","Asian","Yes","Yes","No","Employed","7 to 12","MSK","Work related","Non-workers comp","Industry 2","Occupation 3","Health provider","Voc rehab centers","County B","Other",1,0,"No contact info",0,null,0,null,0,null,0,null,"2019-09-12",null,null,null,null,{"$f":"IF(Table1[[#This Row],[First service received]]=1,\"Never dropped\",IF(Table1[[#This Row],[Enrolled]]=1,\"No first service\",IF(Table1[[#This Row],[Expressed interest]]=1,\"Not enrolled\",IF(Table1[[#This Row],[Eligible]]=1,\"Not interested\",IF(Table1[[#This Row],[Contacted]]=1,\"Not eligible\",IF(Table1[[#This Row],[Identified]]=1,\"Not contacted\",\"\"))))))","v":"Not contacted"},{"$f":"_xlfn.CONCAT(Table1[[#This Row],[Reason not contacted]],Table1[[#This Row],[Reason not eligible]],Table1[[#This Row],[Reason not interested]],Table1[[#This Row],[Reason not enrolled]],Table1[[#This Row],[Reason first service not received]])","v":"No contact info"}]
[1621,null,"45 to 64 yrs","M","Non-Hispanic/Latino","White","Yes","Yes","No","Employed","13+ weeks","MSK","Non-work related","Non-workers comp","Industry 4","Occupation 4","Workforce partner","Electronic Health Records","County A","Email",1,1,null,1,null,1,null,0,"Not enrolled reason1",0,null,"2019-09-12","2019-09-25","2019-10-14",null,null,{"$f":"IF(Table1[[#This Row],[First service received]]=1,\"Never dropped\",IF(Table1[[#This Row],[Enrolled]]=1,\"No first service\",IF(Table1[[#This Row],[Expressed interest]]=1,\"Not enrolled\",IF(Table1[[#This Row],[Eligible]]=1,\"Not interested\",IF(Table1[[#This Row],[Contacted]]=1,\"Not eligible\",IF(Table1[[#This Row],[Identified]]=1,\"Not contacted\",\"\"))))))","v":"Not enrolled"},{"$f":"_xlfn.CONCAT(Table1[[#This Row],[Reason not contacted]],Table1[[#This Row],[Reason not eligible]],Table1[[#This Row],[Reason not interested]],Table1[[#This Row],[Reason not enrolled]],Table1[[#This Row],[Reason first service not received]])","v":"Not enrolled reason1"}]
[1032,null,"45 to 64 yrs","M","Non-Hispanic/Latino","Black or African-American","Yes","Yes","No","Employed","7 to 12","MSK","Work related","Workers comp","Industry 1","Occupation 3","Health provider","Worker’s comp database","County B","Phone",1,1,null,1,null,1,null,1,null,1,null,"2019-09-13","2019-09-28","2019-10-02","2019-10-16","2019-10-27",{"$f":"IF(Table1[[#This Row],[First service received]]=1,\"Never dropped\",IF(Table1[[#This Row],[Enrolled]]=1,\"No first service\",IF(Table1[[#This Row],[Expressed interest]]=1,\"Not enrolled\",IF(Table1[[#This Row],[Eligible]]=1,\"Not interested\",IF(Table1[[#This Row],[Contacted]]=1,\"Not eligible\",IF(Table1[[#This Row],[Identified]]=1,\"Not contacted\",\"\"))))))","v":"Never dropped"},{"$f":"_xlfn.CONCAT(Table1[[#This Row],[Reason not contacted]],Table1[[#This Row],[Reason not eligible]],Table1[[#This Row],[Reason not interested]],Table1[[#This Row],[Reason not enrolled]],Table1[[#This Row],[Reason first service not received]])","v":""}]
[1039,null,"25 to 44 yrs","M","Non-Hispanic/Latino","White","Yes","Yes","No","Employed","7 to 12","MSK","Work related","Workers comp","Industry 3","Occupation 2","Self","Electronic Health Records","County B","Phone",1,1,null,1,null,1,null,0,"Circumstances changed",0,null,"2019-09-13","2019-09-26","2019-11-05",null,null,{"$f":"IF(Table1[[#This Row],[First service received]]=1,\"Never dropped\",IF(Table1[[#This Row],[Enrolled]]=1,\"No first service\",IF(Table1[[#This Row],[Expressed interest]]=1,\"Not enrolled\",IF(Table1[[#This Row],[Eligible]]=1,\"Not interested\",IF(Table1[[#This Row],[Contacted]]=1,\"Not eligible\",IF(Table1[[#This Row],[Identified]]=1,\"Not contacted\",\"\"))))))","v":"Not enrolled"},{"$f":"_xlfn.CONCAT(Table1[[#This Row],[Reason not contacted]],Table1[[#This Row],[Reason not eligible]],Table1[[#This Row],[Reason not interested]],Table1[[#This Row],[Reason not enrolled]],Table1[[#This Row],[Reason first service not received]])","v":"Circumstances changed"}]
[1077,null,"45 to 64 yrs","M","Non-Hispanic/Latino","White","Yes","Yes","No","Employed","7 to 12","MSK","Non-work related","Non-workers comp","Industry 1","Occupation 3","Health provider","Voc rehab centers","County B","Email",1,1,null,1,null,0,"Don't want to be in research study",0,null,0,null,"2019-09-13","2019-09-14","2019-10-28",null,null,{"$f":"IF(Table1[[#This Row],[First service received]]=1,\"Never dropped\",IF(Table1[[#This Row],[Enrolled]]=1,\"No first service\",IF(Table1[[#This Row],[Expressed interest]]=1,\"Not enrolled\",IF(Table1[[#This Row],[Eligible]]=1,\"Not interested\",IF(Table1[[#This Row],[Contacted]]=1,\"Not eligible\",IF(Table1[[#This Row],[Identified]]=1,\"Not contacted\",\"\"))))))","v":"Not interested"},{"$f":"_xlfn.CONCAT(Table1[[#This Row],[Reason not contacted]],Table1[[#This Row],[Reason not eligible]],Table1[[#This Row],[Reason not interested]],Table1[[#This Row],[Reason not enrolled]],Table1[[#This Row],[Reason first service not received]])","v":"Don't want to be in research study"}]
[1096,null,"45 to 64 yrs","M","Non-Hispanic/Latino","White","No","Yes","No","Employed","0 to 1","MSK","Non-work related","Non-workers comp","Industry 1","Occupation 1","Health provider","Clinic appointment schedules","County B","Phone",1,0,"Contacted, no response",0,null,0,null,0,null,0,null,"2019-09-13",null,null,null,null,{"$f":"IF(Table1[[#This Row],[First service received]]=1,\"Never dropped\",IF(Table1[[#This Row],[Enrolled]]=1,\"No first service\",IF(Table1[[#This Row],[Expressed interest]]=1,\"Not enrolled\",IF(Table1[[#This Row],[Eligible]]=1,\"Not interested\",IF(Table1[[#This Row],[Contacted]]=1,\"Not eligible\",IF(Table1[[#This Row],[Identified]]=1,\"Not contacted\",\"\"))))))","v":"Not contacted"},{"$f":"_xlfn.CONCAT(Table1[[#This Row],[Reason not contacted]],Table1[[#This Row],[Reason not eligible]],Table1[[#This Row],[Reason not interested]],Table1[[#This Row],[Reason not enrolled]],Table1[[#This Row],[Reason first service not received]])","v":"Contacted, no response"}]
[1130,null,"45 to 64 yrs","M","Non-Hispanic/Latino","White","Yes","Yes","No","Employed","2 to 6","MSK","Non-work related","Non-workers comp","Industry 1","Occupation 3","Health provider","Voc rehab centers","County B","Phone",1,1,null,1,null,1,null,0,"Not enrolled reason1",0,null,"2019-09-13","2019-09-19","2019-10-11",null,null,{"$f":"IF(Table1[[#This Row],[First service received]]=1,\"Never dropped\",IF(Table1[[#This Row],[Enrolled]]=1,\"No first service\",IF(Table1[[#This Row],[Expressed interest]]=1,\"Not enrolled\",IF(Table1[[#This Row],[Eligible]]=1,\"Not interested\",IF(Table1[[#This Row],[Contacted]]=1,\"Not eligible\",IF(Table1[[#This Row],[Identified]]=1,\"Not contacted\",\"\"))))))","v":"Not enrolled"},{"$f":"_xlfn.CONCAT(Table1[[#This Row],[Reason not contacted]],Table1[[#This Row],[Reason not eligible]],Table1[[#This Row],[Reason not interested]],Table1[[#This Row],[Reason not enrolled]],Table1[[#This Row],[Reason first service not received]])","v":"Not enrolled reason1"}]
[1407,null,"45 to 64 yrs","M","Non-Hispanic/Latino","Black or African-American","Yes","Yes","No","Employed","7 to 12","MSK","Work related","Workers comp","Industry 1","Occupation 3","Health provider","Worker’s comp database","County B","Phone",1,1,null,1,null,1,null,1,null,1,null,"2019-09-13","2019-09-28","2019-10-02","2019-10-16","2019-10-27",{"$f":"IF(Table1[[#This Row],[First service received]]=1,\"Never dropped\",IF(Table1[[#This Row],[Enrolled]]=1,\"No first service\",IF(Table1[[#This Row],[Expressed interest]]=1,\"Not enrolled\",IF(Table1[[#This Row],[Eligible]]=1,\"Not interested\",IF(Table1[[#This Row],[Contacted]]=1,\"Not eligible\",IF(Table1[[#This Row],[Identified]]=1,\"Not contacted\",\"\"))))))","v":"Never dropped"},{"$f":"_xlfn.CONCAT(Table1[[#This Row],[Reason not contacted]],Table1[[#This Row],[Reason not eligible]],Table1[[#This Row],[Reason not interested]],Table1[[#This Row],[Reason not enrolled]],Table1[[#This Row],[Reason first service not received]])","v":""}]
[1480,null,"25 to 44 yrs","M","Non-Hispanic/Latino","White","Yes","Yes","No","Employed","13+ weeks","Other","Non-work related","Non-workers comp","Industry 2","Occupation 1","Health provider","Clinic appointment schedules","County B","In person",1,1,null,0,"Ineligible reason1",0,null,0,null,0,null,"2019-09-13","2019-09-27","2019-10-01",null,null,{"$f":"IF(Table1[[#This Row],[First service received]]=1,\"Never dropped\",IF(Table1[[#This Row],[Enrolled]]=1,\"No first service\",IF(Table1[[#This Row],[Expressed interest]]=1,\"Not enrolled\",IF(Table1[[#This Row],[Eligible]]=1,\"Not interested\",IF(Table1[[#This Row],[Contacted]]=1,\"Not eligible\",IF(Table1[[#This Row],[Identified]]=1,\"Not contacted\",\"\"))))))","v":"Not eligible"},{"$f":"_xlfn.CONCAT(Table1[[#This Row],[Reason not contacted]],Table1[[#This Row],[Reason not eligible]],Table1[[#This Row],[Reason not interested]],Table1[[#This Row],[Reason not enrolled]],Table1[[#This Row],[Reason first service not received]])","v":"Ineligible reason1"}]
[1493,null,"45 to 64 yrs","M","Non-Hispanic/Latino","Black or African-American","Yes","Yes","No","Employed","7 to 12","MSK","Work related","Workers comp","Industry 1","Occupation 3","Health provider","Worker’s comp database","County B","Phone",1,1,null,1,null,1,null,1,null,1,null,"2019-09-13","2019-09-28","2019-10-02","2019-10-16","2019-10-27",{"$f":"IF(Table1[[#This Row],[First service received]]=1,\"Never dropped\",IF(Table1[[#This Row],[Enrolled]]=1,\"No first service\",IF(Table1[[#This Row],[Expressed interest]]=1,\"Not enrolled\",IF(Table1[[#This Row],[Eligible]]=1,\"Not interested\",IF(Table1[[#This Row],[Contacted]]=1,\"Not eligible\",IF(Table1[[#This Row],[Identified]]=1,\"Not contacted\",\"\"))))))","v":"Never dropped"},{"$f":"_xlfn.CONCAT(Table1[[#This Row],[Reason not contacted]],Table1[[#This Row],[Reason not eligible]],Table1[[#This Row],[Reason not interested]],Table1[[#This Row],[Reason not enrolled]],Table1[[#This Row],[Reason first service not received]])","v":""}]
[1611,null,"18 to 24 yrs","M","Non-Hispanic/Latino","White","Yes","Yes","No","Employed","2 to 6","MSK","Non-work related","Non-workers comp","Industry 3","Occupation 1","Health provider","Clinic appointment schedules","County B","Email",1,1,null,1,null,0,"Impact on provider relationship",0,null,0,null,"2019-09-13","2019-09-19","2019-10-20",null,null,{"$f":"IF(Table1[[#This Row],[First service received]]=1,\"Never dropped\",IF(Table1[[#This Row],[Enrolled]]=1,\"No first service\",IF(Table1[[#This Row],[Expressed interest]]=1,\"Not enrolled\",IF(Table1[[#This Row],[Eligible]]=1,\"Not interested\",IF(Table1[[#This Row],[Contacted]]=1,\"Not eligible\",IF(Table1[[#This Row],[Identified]]=1,\"Not contacted\",\"\"))))))","v":"Not interested"},{"$f":"_xlfn.CONCAT(Table1[[#This Row],[Reason not contacted]],Table1[[#This Row],[Reason not eligible]],Table1[[#This Row],[Reason not interested]],Table1[[#This Row],[Reason not enrolled]],Table1[[#This Row],[Reason first service not received]])","v":"Impact on provider relationship"}]
[1103,null,"25 to 44 yrs","M","Non-Hispanic/Latino","White","Yes","Yes","No","Employed","7 to 12","MSK","Work related","Workers comp","Industry 1","Occupation 3","Health provider","Worker’s comp database","County B","Email",1,1,null,0,"Ineligible reason3",0,null,0,null,0,null,"2019-09-14","2019-09-25","2019-11-06",null,null,{"$f":"IF(Table1[[#This Row],[First service received]]=1,\"Never dropped\",IF(Table1[[#This Row],[Enrolled]]=1,\"No first service\",IF(Table1[[#This Row],[Expressed interest]]=1,\"Not enrolled\",IF(Table1[[#This Row],[Eligible]]=1,\"Not interested\",IF(Table1[[#This Row],[Contacted]]=1,\"Not eligible\",IF(Table1[[#This Row],[Identified]]=1,\"Not contacted\",\"\"))))))","v":"Not eligible"},{"$f":"_xlfn.CONCAT(Table1[[#This Row],[Reason not contacted]],Table1[[#This Row],[Reason not eligible]],Table1[[#This Row],[Reason not interested]],Table1[[#This Row],[Reason not enrolled]],Table1[[#This Row],[Reason first service not received]])","v":"Ineligible reason3"}]
[1422,null,"45 to 64 yrs","M","Non-Hispanic/Latino","White","No","Yes","No","Employed","13+ weeks","MSK","Non-work related","Non-workers comp","Industry 1","Occupation 1","Health provider","Worker’s comp database","County B","Phone",1,1,null,1,null,1,null,1,null,1,null,"2019-09-14","2019-09-16","2019-09-29","2019-10-02","2019-10-05",{"$f":"IF(Table1[[#This Row],[First service received]]=1,\"Never dropped\",IF(Table1[[#This Row],[Enrolled]]=1,\"No first service\",IF(Table1[[#This Row],[Expressed interest]]=1,\"Not enrolled\",IF(Table1[[#This Row],[Eligible]]=1,\"Not interested\",IF(Table1[[#This Row],[Contacted]]=1,\"Not eligible\",IF(Table1[[#This Row],[Identified]]=1,\"Not contacted\",\"\"))))))","v":"Never dropped"},{"$f":"_xlfn.CONCAT(Table1[[#This Row],[Reason not contacted]],Table1[[#This Row],[Reason not eligible]],Table1[[#This Row],[Reason not interested]],Table1[[#This Row],[Reason not enrolled]],Table1[[#This Row],[Reason first service not received]])","v":""}]
[1461,null,"45 to 64 yrs","M","Non-Hispanic/Latino","White","No","Yes","No","Employed","13+ weeks","MSK","Non-work related","Non-workers comp","Industry 1","Occupation 1","Health provider","Worker’s comp database","County B","Phone",1,1,null,1,null,1,null,1,null,1,null,"2019-09-14","2019-09-16","2019-09-29","2019-10-02","2019-10-05",{"$f":"IF(Table1[[#This Row],[First service received]]=1,\"Never dropped\",IF(Table1[[#This Row],[Enrolled]]=1,\"No first service\",IF(Table1[[#This Row],[Expressed interest]]=1,\"Not enrolled\",IF(Table1[[#This Row],[Eligible]]=1,\"Not interested\",IF(Table1[[#This Row],[Contacted]]=1,\"Not eligible\",IF(Table1[[#This Row],[Identified]]=1,\"Not contacted\",\"\"))))))","v":"Never dropped"},{"$f":"_xlfn.CONCAT(Table1[[#This Row],[Reason not contacted]],Table1[[#This Row],[Reason not eligible]],Table1[[#This Row],[Reason not interested]],Table1[[#This Row],[Reason not enrolled]],Table1[[#This Row],[Reason first service not received]])","v":""}]
[1492,null,"45 to 64 yrs","M","Non-Hispanic/Latino","White","Yes","Yes","No","Employed","7 to 12","MSK","Non-work related","Non-workers comp","Industry 2","Occupation 3","Health provider","Worker’s comp database","County B","In person",1,1,null,0,"Ineligible reason1",0,null,0,null,0,null,"2019-09-14","2019-09-22","2019-09-25",null,null,{"$f":"IF(Table1[[#This Row],[First service received]]=1,\"Never dropped\",IF(Table1[[#This Row],[Enrolled]]=1,\"No first service\",IF(Table1[[#This Row],[Expressed interest]]=1,\"Not enrolled\",IF(Table1[[#This Row],[Eligible]]=1,\"Not interested\",IF(Table1[[#This Row],[Contacted]]=1,\"Not eligible\",IF(Table1[[#This Row],[Identified]]=1,\"Not contacted\",\"\"))))))","v":"Not eligible"},{"$f":"_xlfn.CONCAT(Table1[[#This Row],[Reason not contacted]],Table1[[#This Row],[Reason not eligible]],Table1[[#This Row],[Reason not interested]],Table1[[#This Row],[Reason not enrolled]],Table1[[#This Row],[Reason first service not received]])","v":"Ineligible reason1"}]
[1563,null,"45 to 64 yrs","M","Non-Hispanic/Latino","White","No","Yes","No","Employed","13+ weeks","MSK","Non-work related","Non-workers comp","Industry 1","Occupation 1","Health provider","Worker’s comp database","County B","Phone",1,1,null,1,null,1,null,1,null,1,null,"2019-09-14","2019-09-16","2019-09-29","2019-10-02","2019-10-05",{"$f":"IF(Table1[[#This Row],[First service received]]=1,\"Never dropped\",IF(Table1[[#This Row],[Enrolled]]=1,\"No first service\",IF(Table1[[#This Row],[Expressed interest]]=1,\"Not enrolled\",IF(Table1[[#This Row],[Eligible]]=1,\"Not interested\",IF(Table1[[#This Row],[Contacted]]=1,\"Not eligible\",IF(Table1[[#This Row],[Identified]]=1,\"Not contacted\",\"\"))))))","v":"Never dropped"},{"$f":"_xlfn.CONCAT(Table1[[#This Row],[Reason not contacted]],Table1[[#This Row],[Reason not eligible]],Table1[[#This Row],[Reason not interested]],Table1[[#This Row],[Reason not enrolled]],Table1[[#This Row],[Reason first service not received]])","v":""}]
[1088,null,"25 to 44 yrs","M","Non-Hispanic/Latino","Other or 2 or more","Yes","Yes","No","Employed","2 to 6","MSK","Non-work related","Non-workers comp","Industry 3","Occupation 2","Health provider","Work restriction forms","County B","In person",1,1,null,0,"Ineligible reason1",0,null,0,null,0,null,"2019-09-15","2019-09-26","2019-10-03",null,null,{"$f":"IF(Table1[[#This Row],[First service received]]=1,\"Never dropped\",IF(Table1[[#This Row],[Enrolled]]=1,\"No first service\",IF(Table1[[#This Row],[Expressed interest]]=1,\"Not enrolled\",IF(Table1[[#This Row],[Eligible]]=1,\"Not interested\",IF(Table1[[#This Row],[Contacted]]=1,\"Not eligible\",IF(Table1[[#This Row],[Identified]]=1,\"Not contacted\",\"\"))))))","v":"Not eligible"},{"$f":"_xlfn.CONCAT(Table1[[#This Row],[Reason not contacted]],Table1[[#This Row],[Reason not eligible]],Table1[[#This Row],[Reason not interested]],Table1[[#This Row],[Reason not enrolled]],Table1[[#This Row],[Reason first service not received]])","v":"Ineligible reason1"}]
[1201,null,"25 to 44 yrs","F","Non-Hispanic/Latino","American Indian or Alaska Native","Yes","Yes","No","Employed","2 to 6","Cardio or Respiratory","Non-work related","Non-workers comp","Industry 4","Occupation 3","Health provider","Clinic appointment schedules","County B","Email",1,1,null,0,"Ineligible reason1",0,null,0,null,0,null,"2019-09-15","2019-09-28","2019-10-18",null,null,{"$f":"IF(Table1[[#This Row],[First service received]]=1,\"Never dropped\",IF(Table1[[#This Row],[Enrolled]]=1,\"No first service\",IF(Table1[[#This Row],[Expressed interest]]=1,\"Not enrolled\",IF(Table1[[#This Row],[Eligible]]=1,\"Not interested\",IF(Table1[[#This Row],[Contacted]]=1,\"Not eligible\",IF(Table1[[#This Row],[Identified]]=1,\"Not contacted\",\"\"))))))","v":"Not eligible"},{"$f":"_xlfn.CONCAT(Table1[[#This Row],[Reason not contacted]],Table1[[#This Row],[Reason not eligible]],Table1[[#This Row],[Reason not interested]],Table1[[#This Row],[Reason not enrolled]],Table1[[#This Row],[Reason first service not received]])","v":"Ineligible reason1"}]
[1291,null,"25 to 44 yrs","M","Non-Hispanic/Latino","Black or African-American","Yes","Yes","No","Employed","2 to 6","MSK","Non-work related","Non-workers comp","Industry 2","Occupation 3","Employer","Electronic Health Records","County B","Email",1,1,null,0,"Ineligible reason3",0,null,0,null,0,null,"2019-09-15","2019-09-26","2019-11-04",null,null,{"$f":"IF(Table1[[#This Row],[First service received]]=1,\"Never dropped\",IF(Table1[[#This Row],[Enrolled]]=1,\"No first service\",IF(Table1[[#This Row],[Expressed interest]]=1,\"Not enrolled\",IF(Table1[[#This Row],[Eligible]]=1,\"Not interested\",IF(Table1[[#This Row],[Contacted]]=1,\"Not eligible\",IF(Table1[[#This Row],[Identified]]=1,\"Not contacted\",\"\"))))))","v":"Not eligible"},{"$f":"_xlfn.CONCAT(Table1[[#This Row],[Reason not contacted]],Table1[[#This Row],[Reason not eligible]],Table1[[#This Row],[Reason not interested]],Table1[[#This Row],[Reason not enrolled]],Table1[[#This Row],[Reason first service not received]])","v":"Ineligible reason3"}]
[1370,null,"25 to 44 yrs","M","Hispanic/Latino","White","Yes","Yes","No","Employed","2 to 6","MSK","Work related","Non-workers comp","Industry 3","Occupation 2","Health provider","Worker’s comp database","County B","Other",1,0,"No contact info",0,null,0,null,0,null,0,null,"2019-09-15",null,null,null,null,{"$f":"IF(Table1[[#This Row],[First service received]]=1,\"Never dropped\",IF(Table1[[#This Row],[Enrolled]]=1,\"No first service\",IF(Table1[[#This Row],[Expressed interest]]=1,\"Not enrolled\",IF(Table1[[#This Row],[Eligible]]=1,\"Not interested\",IF(Table1[[#This Row],[Contacted]]=1,\"Not eligible\",IF(Table1[[#This Row],[Identified]]=1,\"Not contacted\",\"\"))))))","v":"Not contacted"},{"$f":"_xlfn.CONCAT(Table1[[#This Row],[Reason not contacted]],Table1[[#This Row],[Reason not eligible]],Table1[[#This Row],[Reason not interested]],Table1[[#This Row],[Reason not enrolled]],Table1[[#This Row],[Reason first service not received]])","v":"No contact info"}]
[1372,null,"25 to 44 yrs","F","Non-Hispanic/Latino","White","Yes","Yes","No","Employed","7 to 12","MSK","Non-work related","Non-workers comp","Industry 1","Occupation 1","Health provider","Worker’s comp database","County B","Phone",1,1,null,1,null,0,"Don't want to be in research study",0,null,0,null,"2019-09-15","2019-09-25","2019-10-11",null,null,{"$f":"IF(Table1[[#This Row],[First service received]]=1,\"Never dropped\",IF(Table1[[#This Row],[Enrolled]]=1,\"No first service\",IF(Table1[[#This Row],[Expressed interest]]=1,\"Not enrolled\",IF(Table1[[#This Row],[Eligible]]=1,\"Not interested\",IF(Table1[[#This Row],[Contacted]]=1,\"Not eligible\",IF(Table1[[#This Row],[Identified]]=1,\"Not contacted\",\"\"))))))","v":"Not interested"},{"$f":"_xlfn.CONCAT(Table1[[#This Row],[Reason not contacted]],Table1[[#This Row],[Reason not eligible]],Table1[[#This Row],[Reason not interested]],Table1[[#This Row],[Reason not enrolled]],Table1[[#This Row],[Reason first service not received]])","v":"Don't want to be in research study"}]
[1415,null,"25 to 44 yrs","M","Non-Hispanic/Latino","White","Yes","No","No","Employed","7 to 12","MSK","Non-work related","Non-workers comp","Industry 4","Occupation 1","Self","Electronic Health Records","County B","In person",1,1,null,1,null,0,"Impact on provider relationship",0,null,0,null,"2019-09-15","2019-09-26","2019-09-28",null,null,{"$f":"IF(Table1[[#This Row],[First service received]]=1,\"Never dropped\",IF(Table1[[#This Row],[Enrolled]]=1,\"No first service\",IF(Table1[[#This Row],[Expressed interest]]=1,\"Not enrolled\",IF(Table1[[#This Row],[Eligible]]=1,\"Not interested\",IF(Table1[[#This Row],[Contacted]]=1,\"Not eligible\",IF(Table1[[#This Row],[Identified]]=1,\"Not contacted\",\"\"))))))","v":"Not interested"},{"$f":"_xlfn.CONCAT(Table1[[#This Row],[Reason not contacted]],Table1[[#This Row],[Reason not eligible]],Table1[[#This Row],[Reason not interested]],Table1[[#This Row],[Reason not enrolled]],Table1[[#This Row],[Reason first service not received]])","v":"Impact on provider relationship"}]
[1478,null,"18 to 24 yrs","F","Hispanic/Latino","White","Yes","No","No","Employed","7 to 12","MSK","Non-work related","Non-workers comp","Industry 4","Occupation 1","Self","Electronic Health Records","County A","Email",1,0,"Contacted, no response",0,null,0,null,0,null,0,null,"2019-09-15",null,null,null,null,{"$f":"IF(Table1[[#This Row],[First service received]]=1,\"Never dropped\",IF(Table1[[#This Row],[Enrolled]]=1,\"No first service\",IF(Table1[[#This Row],[Expressed interest]]=1,\"Not enrolled\",IF(Table1[[#This Row],[Eligible]]=1,\"Not interested\",IF(Table1[[#This Row],[Contacted]]=1,\"Not eligible\",IF(Table1[[#This Row],[Identified]]=1,\"Not contacted\",\"\"))))))","v":"Not contacted"},{"$f":"_xlfn.CONCAT(Table1[[#This Row],[Reason not contacted]],Table1[[#This Row],[Reason not eligible]],Table1[[#This Row],[Reason not interested]],Table1[[#This Row],[Reason not enrolled]],Table1[[#This Row],[Reason first service not received]])","v":"Contacted, no response"}]
[1168,null,"25 to 44 yrs","M","Non-Hispanic/Latino","White","Yes","Yes","No","Employed","7 to 12","MSK","Non-work related","Non-workers comp","Industry 1","Occupation 1","Health provider","Work restriction forms","County B","Phone",1,1,null,1,null,1,null,0,"Circumstances changed",0,null,"2019-09-16","2019-09-25","2019-11-04",null,null,{"$f":"IF(Table1[[#This Row],[First service received]]=1,\"Never dropped\",IF(Table1[[#This Row],[Enrolled]]=1,\"No first service\",IF(Table1[[#This Row],[Expressed interest]]=1,\"Not enrolled\",IF(Table1[[#This Row],[Eligible]]=1,\"Not interested\",IF(Table1[[#This Row],[Contacted]]=1,\"Not eligible\",IF(Table1[[#This Row],[Identified]]=1,\"Not contacted\",\"\"))))))","v":"Not enrolled"},{"$f":"_xlfn.CONCAT(Table1[[#This Row],[Reason not contacted]],Table1[[#This Row],[Reason not eligible]],Table1[[#This Row],[Reason not interested]],Table1[[#This Row],[Reason not enrolled]],Table1[[#This Row],[Reason first service not received]])","v":"Circumstances changed"}]
[1208,null,"25 to 44 yrs","M","Non-Hispanic/Latino","White","No","Yes","No","Employed","7 to 12","MSK","Non-work related","Non-workers comp","Industry 3","Occupation 2","Health provider","Clinic appointment schedules","County B","Phone",1,1,null,1,null,1,null,1,null,1,null,"2019-09-16","2019-09-23","2019-09-27","2019-10-18","2019-11-01",{"$f":"IF(Table1[[#This Row],[First service received]]=1,\"Never dropped\",IF(Table1[[#This Row],[Enrolled]]=1,\"No first service\",IF(Table1[[#This Row],[Expressed interest]]=1,\"Not enrolled\",IF(Table1[[#This Row],[Eligible]]=1,\"Not interested\",IF(Table1[[#This Row],[Contacted]]=1,\"Not eligible\",IF(Table1[[#This Row],[Identified]]=1,\"Not contacted\",\"\"))))))","v":"Never dropped"},{"$f":"_xlfn.CONCAT(Table1[[#This Row],[Reason not contacted]],Table1[[#This Row],[Reason not eligible]],Table1[[#This Row],[Reason not interested]],Table1[[#This Row],[Reason not enrolled]],Table1[[#This Row],[Reason first service not received]])","v":""}]
[1357,null,"25 to 44 yrs","M","Non-Hispanic/Latino","White","No","Yes","No","Employed","7 to 12","MSK","Non-work related","Non-workers comp","Industry 3","Occupation 2","Health provider","Clinic appointment schedules","County B","Phone",1,1,null,1,null,1,null,1,null,1,null,"2019-09-16","2019-09-23","2019-09-27","2019-10-18","2019-11-01",{"$f":"IF(Table1[[#This Row],[First service received]]=1,\"Never dropped\",IF(Table1[[#This Row],[Enrolled]]=1,\"No first service\",IF(Table1[[#This Row],[Expressed interest]]=1,\"Not enrolled\",IF(Table1[[#This Row],[Eligible]]=1,\"Not interested\",IF(Table1[[#This Row],[Contacted]]=1,\"Not eligible\",IF(Table1[[#This Row],[Identified]]=1,\"Not contacted\",\"\"))))))","v":"Never dropped"},{"$f":"_xlfn.CONCAT(Table1[[#This Row],[Reason not contacted]],Table1[[#This Row],[Reason not eligible]],Table1[[#This Row],[Reason not interested]],Table1[[#This Row],[Reason not enrolled]],Table1[[#This Row],[Reason first service not received]])","v":""}]
[1481,null,"25 to 44 yrs","M","Non-Hispanic/Latino","White","No","Yes","No","Employed","7 to 12","MSK","Non-work related","Non-workers comp","Industry 3","Occupation 2","Health provider","Clinic appointment schedules","County B","Phone",1,1,null,1,null,1,null,1,null,1,null,"2019-09-16","2019-09-23","2019-09-27","2019-10-18","2019-11-01",{"$f":"IF(Table1[[#This Row],[First service received]]=1,\"Never dropped\",IF(Table1[[#This Row],[Enrolled]]=1,\"No first service\",IF(Table1[[#This Row],[Expressed interest]]=1,\"Not enrolled\",IF(Table1[[#This Row],[Eligible]]=1,\"Not interested\",IF(Table1[[#This Row],[Contacted]]=1,\"Not eligible\",IF(Table1[[#This Row],[Identified]]=1,\"Not contacted\",\"\"))))))","v":"Never dropped"},{"$f":"_xlfn.CONCAT(Table1[[#This Row],[Reason not contacted]],Table1[[#This Row],[Reason not eligible]],Table1[[#This Row],[Reason not interested]],Table1[[#This Row],[Reason not enrolled]],Table1[[#This Row],[Reason first service not received]])","v":""}]
[1534,null,"25 to 44 yrs","M","Non-Hispanic/Latino","White","Yes","Yes","No","Employed","7 to 12","MSK","Work related","Non-workers comp","Industry 2","Occupation 3","Health provider","Work restriction forms","County B","In person",1,1,null,0,"Ineligible reason1",0,null,0,null,0,null,"2019-09-16","2019-09-20","2019-10-14",null,null,{"$f":"IF(Table1[[#This Row],[First service received]]=1,\"Never dropped\",IF(Table1[[#This Row],[Enrolled]]=1,\"No first service\",IF(Table1[[#This Row],[Expressed interest]]=1,\"Not enrolled\",IF(Table1[[#This Row],[Eligible]]=1,\"Not interested\",IF(Table1[[#This Row],[Contacted]]=1,\"Not eligible\",IF(Table1[[#This Row],[Identified]]=1,\"Not contacted\",\"\"))))))","v":"Not eligible"},{"$f":"_xlfn.CONCAT(Table1[[#This Row],[Reason not contacted]],Table1[[#This Row],[Reason not eligible]],Table1[[#This Row],[Reason not interested]],Table1[[#This Row],[Reason not enrolled]],Table1[[#This Row],[Reason first service not received]])","v":"Ineligible reason1"}]
[1535,null,"45 to 64 yrs","F","Non-Hispanic/Latino","White","No","Yes","No","Self-employed","13+ weeks","Other","Non-work related","Non-workers comp","Industry 1","Occupation 1","Health provider","Work restriction forms","County B","Phone",1,1,null,0,"Ineligible reason2",0,null,0,null,0,null,"2019-09-16","2019-09-20","2019-10-17",null,null,{"$f":"IF(Table1[[#This Row],[First service received]]=1,\"Never dropped\",IF(Table1[[#This Row],[Enrolled]]=1,\"No first service\",IF(Table1[[#This Row],[Expressed interest]]=1,\"Not enrolled\",IF(Table1[[#This Row],[Eligible]]=1,\"Not interested\",IF(Table1[[#This Row],[Contacted]]=1,\"Not eligible\",IF(Table1[[#This Row],[Identified]]=1,\"Not contacted\",\"\"))))))","v":"Not eligible"},{"$f":"_xlfn.CONCAT(Table1[[#This Row],[Reason not contacted]],Table1[[#This Row],[Reason not eligible]],Table1[[#This Row],[Reason not interested]],Table1[[#This Row],[Reason not enrolled]],Table1[[#This Row],[Reason first service not received]])","v":"Ineligible reason2"}]
[1613,null,"25 to 44 yrs","M","Non-Hispanic/Latino","Black or African-American","No","Yes","No","Employed","7 to 12","MSK","Non-work related","Non-workers comp","Industry 4","Occupation 3","Health provider","Work restriction forms","County B","Email",1,1,null,1,null,0,"Impact on provider relationship",0,null,0,null,"2019-09-16","2019-09-17","2019-10-04",null,null,{"$f":"IF(Table1[[#This Row],[First service received]]=1,\"Never dropped\",IF(Table1[[#This Row],[Enrolled]]=1,\"No first service\",IF(Table1[[#This Row],[Expressed interest]]=1,\"Not enrolled\",IF(Table1[[#This Row],[Eligible]]=1,\"Not interested\",IF(Table1[[#This Row],[Contacted]]=1,\"Not eligible\",IF(Table1[[#This Row],[Identified]]=1,\"Not contacted\",\"\"))))))","v":"Not interested"},{"$f":"_xlfn.CONCAT(Table1[[#This Row],[Reason not contacted]],Table1[[#This Row],[Reason not eligible]],Table1[[#This Row],[Reason not interested]],Table1[[#This Row],[Reason not enrolled]],Table1[[#This Row],[Reason first service not received]])","v":"Impact on provider relationship"}]
[1025,"lorem ipsum","25 to 44 yrs","M","Non-Hispanic/Latino","White","Yes","Yes","No","Employed","7 to 12","Other","Work related","Workers comp","Industry 2","Occupation 1","Health provider","Worker’s comp database","County B","Email",1,1,null,1,null,0,"Not interested reason3",0,null,0,null,"2019-09-17","2019-10-02","2019-11-07",null,null,{"$f":"IF(Table1[[#This Row],[First service received]]=1,\"Never dropped\",IF(Table1[[#This Row],[Enrolled]]=1,\"No first service\",IF(Table1[[#This Row],[Expressed interest]]=1,\"Not enrolled\",IF(Table1[[#This Row],[Eligible]]=1,\"Not interested\",IF(Table1[[#This Row],[Contacted]]=1,\"Not eligible\",IF(Table1[[#This Row],[Identified]]=1,\"Not contacted\",\"\"))))))","v":"Not interested"},{"$f":"_xlfn.CONCAT(Table1[[#This Row],[Reason not contacted]],Table1[[#This Row],[Reason not eligible]],Table1[[#This Row],[Reason not interested]],Table1[[#This Row],[Reason not enrolled]],Table1[[#This Row],[Reason first service not received]])","v":"Not interested reason3"}]
[1210,null,"25 to 44 yrs","F","Non-Hispanic/Latino","Black or African-American","No","Yes","No","Employed","2 to 6","Other","Work related","Non-workers comp","Industry 2","Occupation 4","Health provider","Clinic appointment schedules","County B","Phone",1,1,null,1,null,0,"Impact on provider relationship",0,null,0,null,"2019-09-17","2019-09-27","2019-10-02",null,null,{"$f":"IF(Table1[[#This Row],[First service received]]=1,\"Never dropped\",IF(Table1[[#This Row],[Enrolled]]=1,\"No first service\",IF(Table1[[#This Row],[Expressed interest]]=1,\"Not enrolled\",IF(Table1[[#This Row],[Eligible]]=1,\"Not interested\",IF(Table1[[#This Row],[Contacted]]=1,\"Not eligible\",IF(Table1[[#This Row],[Identified]]=1,\"Not contacted\",\"\"))))))","v":"Not interested"},{"$f":"_xlfn.CONCAT(Table1[[#This Row],[Reason not contacted]],Table1[[#This Row],[Reason not eligible]],Table1[[#This Row],[Reason not interested]],Table1[[#This Row],[Reason not enrolled]],Table1[[#This Row],[Reason first service not received]])","v":"Impact on provider relationship"}]
[1272,null,"45 to 64 yrs","M","Non-Hispanic/Latino","White","Yes","Yes","No","Employed","7 to 12","MSK","Non-work related","Non-workers comp","Industry 3","Occupation 3","Health provider","Clinic appointment schedules","County A","Email",1,1,null,1,null,0,"Not interested reason3",0,null,0,null,"2019-09-17","2019-09-22","2019-09-27",null,null,{"$f":"IF(Table1[[#This Row],[First service received]]=1,\"Never dropped\",IF(Table1[[#This Row],[Enrolled]]=1,\"No first service\",IF(Table1[[#This Row],[Expressed interest]]=1,\"Not enrolled\",IF(Table1[[#This Row],[Eligible]]=1,\"Not interested\",IF(Table1[[#This Row],[Contacted]]=1,\"Not eligible\",IF(Table1[[#This Row],[Identified]]=1,\"Not contacted\",\"\"))))))","v":"Not interested"},{"$f":"_xlfn.CONCAT(Table1[[#This Row],[Reason not contacted]],Table1[[#This Row],[Reason not eligible]],Table1[[#This Row],[Reason not interested]],Table1[[#This Row],[Reason not enrolled]],Table1[[#This Row],[Reason first service not received]])","v":"Not interested reason3"}]
[1427,null,"45 to 64 yrs","F","Non-Hispanic/Latino","White","Yes","Yes","No","Employed","7 to 12","MSK","Work related","Workers comp","Industry 4","Occupation 3","Health provider","Work restriction forms","County B","In person",1,0,"Contacted, no response",0,null,0,null,0,null,0,null,"2019-09-17",null,null,null,null,{"$f":"IF(Table1[[#This Row],[First service received]]=1,\"Never dropped\",IF(Table1[[#This Row],[Enrolled]]=1,\"No first service\",IF(Table1[[#This Row],[Expressed interest]]=1,\"Not enrolled\",IF(Table1[[#This Row],[Eligible]]=1,\"Not interested\",IF(Table1[[#This Row],[Contacted]]=1,\"Not eligible\",IF(Table1[[#This Row],[Identified]]=1,\"Not contacted\",\"\"))))))","v":"Not contacted"},{"$f":"_xlfn.CONCAT(Table1[[#This Row],[Reason not contacted]],Table1[[#This Row],[Reason not eligible]],Table1[[#This Row],[Reason not interested]],Table1[[#This Row],[Reason not enrolled]],Table1[[#This Row],[Reason first service not received]])","v":"Contacted, no response"}]
[1449,null,"25 to 44 yrs","M","Non-Hispanic/Latino","White","Yes","Yes","No","Employed","2 to 6","MSK","Non-work related","Non-workers comp","Industry 3","Occupation 2","Health provider","Voc rehab centers","County B","In person",1,1,null,0,"Ineligible reason3",0,null,0,null,0,null,"2019-09-17","2019-10-01","2019-10-10",null,null,{"$f":"IF(Table1[[#This Row],[First service received]]=1,\"Never dropped\",IF(Table1[[#This Row],[Enrolled]]=1,\"No first service\",IF(Table1[[#This Row],[Expressed interest]]=1,\"Not enrolled\",IF(Table1[[#This Row],[Eligible]]=1,\"Not interested\",IF(Table1[[#This Row],[Contacted]]=1,\"Not eligible\",IF(Table1[[#This Row],[Identified]]=1,\"Not contacted\",\"\"))))))","v":"Not eligible"},{"$f":"_xlfn.CONCAT(Table1[[#This Row],[Reason not contacted]],Table1[[#This Row],[Reason not eligible]],Table1[[#This Row],[Reason not interested]],Table1[[#This Row],[Reason not enrolled]],Table1[[#This Row],[Reason first service not received]])","v":"Ineligible reason3"}]
[1011,"lorem ipsum","25 to 44 yrs","F","Non-Hispanic/Latino","White","Yes","Yes","No","Not Employed","0 to 1","MSK","Non-work related","Non-workers comp","Industry 3","Occupation 3","Workforce partner","Electronic Health Records","County A","Email",1,1,null,1,null,1,null,0,"Circumstances changed",0,null,"2019-09-18","2019-09-22","2019-11-06",null,null,{"$f":"IF(Table1[[#This Row],[First service received]]=1,\"Never dropped\",IF(Table1[[#This Row],[Enrolled]]=1,\"No first service\",IF(Table1[[#This Row],[Expressed interest]]=1,\"Not enrolled\",IF(Table1[[#This Row],[Eligible]]=1,\"Not interested\",IF(Table1[[#This Row],[Contacted]]=1,\"Not eligible\",IF(Table1[[#This Row],[Identified]]=1,\"Not contacted\",\"\"))))))","v":"Not enrolled"},{"$f":"_xlfn.CONCAT(Table1[[#This Row],[Reason not contacted]],Table1[[#This Row],[Reason not eligible]],Table1[[#This Row],[Reason not interested]],Table1[[#This Row],[Reason not enrolled]],Table1[[#This Row],[Reason first service not received]])","v":"Circumstances changed"}]
[1086,null,"45 to 64 yrs","M","Non-Hispanic/Latino","White","Yes","Yes","No","Not Employed","0 to 1","MSK","Non-work related","Non-workers comp","Industry 4","Occupation 4","Employer","Electronic Health Records","County A","Phone",1,1,null,1,null,1,null,1,null,1,null,"2019-09-18","2019-09-26","2019-09-28","2019-10-25","2019-11-01",{"$f":"IF(Table1[[#This Row],[First service received]]=1,\"Never dropped\",IF(Table1[[#This Row],[Enrolled]]=1,\"No first service\",IF(Table1[[#This Row],[Expressed interest]]=1,\"Not enrolled\",IF(Table1[[#This Row],[Eligible]]=1,\"Not interested\",IF(Table1[[#This Row],[Contacted]]=1,\"Not eligible\",IF(Table1[[#This Row],[Identified]]=1,\"Not contacted\",\"\"))))))","v":"Never dropped"},{"$f":"_xlfn.CONCAT(Table1[[#This Row],[Reason not contacted]],Table1[[#This Row],[Reason not eligible]],Table1[[#This Row],[Reason not interested]],Table1[[#This Row],[Reason not enrolled]],Table1[[#This Row],[Reason first service not received]])","v":""}]
[1309,null,"45 to 64 yrs","M","Non-Hispanic/Latino","White","Yes","Yes","No","Not Employed","0 to 1","MSK","Non-work related","Non-workers comp","Industry 4","Occupation 4","Employer","Electronic Health Records","County A","Phone",1,1,null,1,null,1,null,1,null,1,null,"2019-09-18","2019-09-26","2019-09-28","2019-10-25","2019-11-01",{"$f":"IF(Table1[[#This Row],[First service received]]=1,\"Never dropped\",IF(Table1[[#This Row],[Enrolled]]=1,\"No first service\",IF(Table1[[#This Row],[Expressed interest]]=1,\"Not enrolled\",IF(Table1[[#This Row],[Eligible]]=1,\"Not interested\",IF(Table1[[#This Row],[Contacted]]=1,\"Not eligible\",IF(Table1[[#This Row],[Identified]]=1,\"Not contacted\",\"\"))))))","v":"Never dropped"},{"$f":"_xlfn.CONCAT(Table1[[#This Row],[Reason not contacted]],Table1[[#This Row],[Reason not eligible]],Table1[[#This Row],[Reason not interested]],Table1[[#This Row],[Reason not enrolled]],Table1[[#This Row],[Reason first service not received]])","v":""}]
[1318,null,"45 to 64 yrs","M","Non-Hispanic/Latino","White","Yes","Yes","No","Not Employed","0 to 1","MSK","Non-work related","Non-workers comp","Industry 4","Occupation 4","Employer","Electronic Health Records","County A","Phone",1,1,null,1,null,1,null,1,null,1,null,"2019-09-18","2019-09-26","2019-09-28","2019-10-25","2019-11-01",{"$f":"IF(Table1[[#This Row],[First service received]]=1,\"Never dropped\",IF(Table1[[#This Row],[Enrolled]]=1,\"No first service\",IF(Table1[[#This Row],[Expressed interest]]=1,\"Not enrolled\",IF(Table1[[#This Row],[Eligible]]=1,\"Not interested\",IF(Table1[[#This Row],[Contacted]]=1,\"Not eligible\",IF(Table1[[#This Row],[Identified]]=1,\"Not contacted\",\"\"))))))","v":"Never dropped"},{"$f":"_xlfn.CONCAT(Table1[[#This Row],[Reason not contacted]],Table1[[#This Row],[Reason not eligible]],Table1[[#This Row],[Reason not interested]],Table1[[#This Row],[Reason not enrolled]],Table1[[#This Row],[Reason first service not received]])","v":""}]
[1501,null,"25 to 44 yrs","M","Non-Hispanic/Latino","American Indian or Alaska Native","Yes","Yes","No","Employed","2 to 6","MSK","Non-work related","Non-workers comp","Industry 3","Occupation 2","Self","Electronic Health Records","County B","Phone",1,1,null,1,null,1,null,0,"Not enrolled reason1",0,null,"2019-09-18","2019-09-22","2019-09-30",null,null,{"$f":"IF(Table1[[#This Row],[First service received]]=1,\"Never dropped\",IF(Table1[[#This Row],[Enrolled]]=1,\"No first service\",IF(Table1[[#This Row],[Expressed interest]]=1,\"Not enrolled\",IF(Table1[[#This Row],[Eligible]]=1,\"Not interested\",IF(Table1[[#This Row],[Contacted]]=1,\"Not eligible\",IF(Table1[[#This Row],[Identified]]=1,\"Not contacted\",\"\"))))))","v":"Not enrolled"},{"$f":"_xlfn.CONCAT(Table1[[#This Row],[Reason not contacted]],Table1[[#This Row],[Reason not eligible]],Table1[[#This Row],[Reason not interested]],Table1[[#This Row],[Reason not enrolled]],Table1[[#This Row],[Reason first service not received]])","v":"Not enrolled reason1"}]
[1619,null,"25 to 44 yrs","F","Non-Hispanic/Latino","White","Yes","Yes","No","Employed","2 to 6","MSK","Non-work related","Non-workers comp","Industry 4","Occupation 4","Health provider","Work restriction forms","County B","In person",1,1,null,1,null,0,"Not interested reason3",0,null,0,null,"2019-09-18","2019-09-23","2019-10-17",null,null,{"$f":"IF(Table1[[#This Row],[First service received]]=1,\"Never dropped\",IF(Table1[[#This Row],[Enrolled]]=1,\"No first service\",IF(Table1[[#This Row],[Expressed interest]]=1,\"Not enrolled\",IF(Table1[[#This Row],[Eligible]]=1,\"Not interested\",IF(Table1[[#This Row],[Contacted]]=1,\"Not eligible\",IF(Table1[[#This Row],[Identified]]=1,\"Not contacted\",\"\"))))))","v":"Not interested"},{"$f":"_xlfn.CONCAT(Table1[[#This Row],[Reason not contacted]],Table1[[#This Row],[Reason not eligible]],Table1[[#This Row],[Reason not interested]],Table1[[#This Row],[Reason not enrolled]],Table1[[#This Row],[Reason first service not received]])","v":"Not interested reason3"}]
[1061,null,"25 to 44 yrs","F","Non-Hispanic/Latino","White","Yes","Yes","No","Employed","2 to 6","MSK","Non-work related","Non-workers comp","Industry 2","Occupation 3","Health provider","Worker’s comp database","County B","Other",1,0,"Inaccurate contact info",0,null,0,null,0,null,0,null,"2019-09-19",null,null,null,null,{"$f":"IF(Table1[[#This Row],[First service received]]=1,\"Never dropped\",IF(Table1[[#This Row],[Enrolled]]=1,\"No first service\",IF(Table1[[#This Row],[Expressed interest]]=1,\"Not enrolled\",IF(Table1[[#This Row],[Eligible]]=1,\"Not interested\",IF(Table1[[#This Row],[Contacted]]=1,\"Not eligible\",IF(Table1[[#This Row],[Identified]]=1,\"Not contacted\",\"\"))))))","v":"Not contacted"},{"$f":"_xlfn.CONCAT(Table1[[#This Row],[Reason not contacted]],Table1[[#This Row],[Reason not eligible]],Table1[[#This Row],[Reason not interested]],Table1[[#This Row],[Reason not enrolled]],Table1[[#This Row],[Reason first service not received]])","v":"Inaccurate contact info"}]
[1173,null,"45 to 64 yrs","M","Non-Hispanic/Latino","Black or African-American","Yes","Yes","No","Employed","2 to 6","MSK","Non-work related","Non-workers comp","Industry 3","Occupation 2","Health provider","Worker’s comp database","County B","Phone",1,1,null,1,null,1,null,1,null,1,null,"2019-09-19","2019-09-25","2019-09-25","2019-10-25","2019-10-26",{"$f":"IF(Table1[[#This Row],[First service received]]=1,\"Never dropped\",IF(Table1[[#This Row],[Enrolled]]=1,\"No first service\",IF(Table1[[#This Row],[Expressed interest]]=1,\"Not enrolled\",IF(Table1[[#This Row],[Eligible]]=1,\"Not interested\",IF(Table1[[#This Row],[Contacted]]=1,\"Not eligible\",IF(Table1[[#This Row],[Identified]]=1,\"Not contacted\",\"\"))))))","v":"Never dropped"},{"$f":"_xlfn.CONCAT(Table1[[#This Row],[Reason not contacted]],Table1[[#This Row],[Reason not eligible]],Table1[[#This Row],[Reason not interested]],Table1[[#This Row],[Reason not enrolled]],Table1[[#This Row],[Reason first service not received]])","v":""}]
[1385,null,"25 to 44 yrs","M","Non-Hispanic/Latino","White","Yes","Yes","No","Not Employed","0 to 1","MSK","Non-work related","Non-workers comp","Industry 1","Occupation 3","Health provider","Work restriction forms","County B","Email",1,1,null,1,null,0,"Impact on provider relationship",0,null,0,null,"2019-09-19","2019-09-23","2019-10-26",null,null,{"$f":"IF(Table1[[#This Row],[First service received]]=1,\"Never dropped\",IF(Table1[[#This Row],[Enrolled]]=1,\"No first service\",IF(Table1[[#This Row],[Expressed interest]]=1,\"Not enrolled\",IF(Table1[[#This Row],[Eligible]]=1,\"Not interested\",IF(Table1[[#This Row],[Contacted]]=1,\"Not eligible\",IF(Table1[[#This Row],[Identified]]=1,\"Not contacted\",\"\"))))))","v":"Not interested"},{"$f":"_xlfn.CONCAT(Table1[[#This Row],[Reason not contacted]],Table1[[#This Row],[Reason not eligible]],Table1[[#This Row],[Reason not interested]],Table1[[#This Row],[Reason not enrolled]],Table1[[#This Row],[Reason first service not received]])","v":"Impact on provider relationship"}]
[1482,null,"45 to 64 yrs","M","Non-Hispanic/Latino","Black or African-American","Yes","Yes","No","Employed","2 to 6","MSK","Non-work related","Non-workers comp","Industry 3","Occupation 2","Health provider","Worker’s comp database","County B","Phone",1,1,null,1,null,1,null,1,null,1,null,"2019-09-19","2019-09-25","2019-09-25","2019-10-25","2019-10-26",{"$f":"IF(Table1[[#This Row],[First service received]]=1,\"Never dropped\",IF(Table1[[#This Row],[Enrolled]]=1,\"No first service\",IF(Table1[[#This Row],[Expressed interest]]=1,\"Not enrolled\",IF(Table1[[#This Row],[Eligible]]=1,\"Not interested\",IF(Table1[[#This Row],[Contacted]]=1,\"Not eligible\",IF(Table1[[#This Row],[Identified]]=1,\"Not contacted\",\"\"))))))","v":"Never dropped"},{"$f":"_xlfn.CONCAT(Table1[[#This Row],[Reason not contacted]],Table1[[#This Row],[Reason not eligible]],Table1[[#This Row],[Reason not interested]],Table1[[#This Row],[Reason not enrolled]],Table1[[#This Row],[Reason first service not received]])","v":""}]
[1203,null,"45 to 64 yrs","M","Non-Hispanic/Latino","White","Yes","Yes","No","Not Employed","0 to 1","MSK","Work related","Non-workers comp","Industry 4","Occupation 3","Health provider","Worker’s comp database","County B","Phone",1,1,null,0,"Ineligible reason1",0,null,0,null,0,null,"2019-09-20","2019-10-05","2019-11-07",null,null,{"$f":"IF(Table1[[#This Row],[First service received]]=1,\"Never dropped\",IF(Table1[[#This Row],[Enrolled]]=1,\"No first service\",IF(Table1[[#This Row],[Expressed interest]]=1,\"Not enrolled\",IF(Table1[[#This Row],[Eligible]]=1,\"Not interested\",IF(Table1[[#This Row],[Contacted]]=1,\"Not eligible\",IF(Table1[[#This Row],[Identified]]=1,\"Not contacted\",\"\"))))))","v":"Not eligible"},{"$f":"_xlfn.CONCAT(Table1[[#This Row],[Reason not contacted]],Table1[[#This Row],[Reason not eligible]],Table1[[#This Row],[Reason not interested]],Table1[[#This Row],[Reason not enrolled]],Table1[[#This Row],[Reason first service not received]])","v":"Ineligible reason1"}]
[1242,null,"25 to 44 yrs","M","Non-Hispanic/Latino","Other or 2 or more","Yes","Yes","No","Employed","7 to 12","MSK","Non-work related","Non-workers comp","Industry 2","Occupation 3","Health provider","Worker’s comp database","County B","Phone",1,1,null,0,"Ineligible reason3",0,null,0,null,0,null,"2019-09-20","2019-10-03","2019-10-18",null,null,{"$f":"IF(Table1[[#This Row],[First service received]]=1,\"Never dropped\",IF(Table1[[#This Row],[Enrolled]]=1,\"No first service\",IF(Table1[[#This Row],[Expressed interest]]=1,\"Not enrolled\",IF(Table1[[#This Row],[Eligible]]=1,\"Not interested\",IF(Table1[[#This Row],[Contacted]]=1,\"Not eligible\",IF(Table1[[#This Row],[Identified]]=1,\"Not contacted\",\"\"))))))","v":"Not eligible"},{"$f":"_xlfn.CONCAT(Table1[[#This Row],[Reason not contacted]],Table1[[#This Row],[Reason not eligible]],Table1[[#This Row],[Reason not interested]],Table1[[#This Row],[Reason not enrolled]],Table1[[#This Row],[Reason first service not received]])","v":"Ineligible reason3"}]
[1400,null,"25 to 44 yrs","F","Non-Hispanic/Latino","White","Yes","Yes","No","Employed","13+ weeks","MSK","Work related","Non-workers comp","Industry 3","Occupation 1","Workforce partner","Electronic Health Records","County B","Phone",1,0,"Contacted, no response",0,null,0,null,0,null,0,null,"2019-09-20",null,null,null,null,{"$f":"IF(Table1[[#This Row],[First service received]]=1,\"Never dropped\",IF(Table1[[#This Row],[Enrolled]]=1,\"No first service\",IF(Table1[[#This Row],[Expressed interest]]=1,\"Not enrolled\",IF(Table1[[#This Row],[Eligible]]=1,\"Not interested\",IF(Table1[[#This Row],[Contacted]]=1,\"Not eligible\",IF(Table1[[#This Row],[Identified]]=1,\"Not contacted\",\"\"))))))","v":"Not contacted"},{"$f":"_xlfn.CONCAT(Table1[[#This Row],[Reason not contacted]],Table1[[#This Row],[Reason not eligible]],Table1[[#This Row],[Reason not interested]],Table1[[#This Row],[Reason not enrolled]],Table1[[#This Row],[Reason first service not received]])","v":"Contacted, no response"}]
[1476,null,"25 to 44 yrs","M","Non-Hispanic/Latino","Other or 2 or more","Yes","Yes","No","Not Employed","0 to 1","MSK","Non-work related","Non-workers comp","Industry 3","Occupation 4","Health provider","Clinic appointment schedules","County C","Phone",1,1,null,0,"Ineligible reason3",0,null,0,null,0,null,"2019-09-20","2019-10-03","2019-10-12",null,null,{"$f":"IF(Table1[[#This Row],[First service received]]=1,\"Never dropped\",IF(Table1[[#This Row],[Enrolled]]=1,\"No first service\",IF(Table1[[#This Row],[Expressed interest]]=1,\"Not enrolled\",IF(Table1[[#This Row],[Eligible]]=1,\"Not interested\",IF(Table1[[#This Row],[Contacted]]=1,\"Not eligible\",IF(Table1[[#This Row],[Identified]]=1,\"Not contacted\",\"\"))))))","v":"Not eligible"},{"$f":"_xlfn.CONCAT(Table1[[#This Row],[Reason not contacted]],Table1[[#This Row],[Reason not eligible]],Table1[[#This Row],[Reason not interested]],Table1[[#This Row],[Reason not enrolled]],Table1[[#This Row],[Reason first service not received]])","v":"Ineligible reason3"}]
[1602,null,"25 to 44 yrs","M","Hispanic/Latino","White","Yes","Yes","No","Employed","13+ weeks","Other","Non-work related","Non-workers comp","Industry 3","Occupation 2","Health provider","Clinic appointment schedules","County A","Email",1,1,null,0,"Ineligible reason1",0,null,0,null,0,null,"2019-09-20","2019-09-27","2019-10-03",null,null,{"$f":"IF(Table1[[#This Row],[First service received]]=1,\"Never dropped\",IF(Table1[[#This Row],[Enrolled]]=1,\"No first service\",IF(Table1[[#This Row],[Expressed interest]]=1,\"Not enrolled\",IF(Table1[[#This Row],[Eligible]]=1,\"Not interested\",IF(Table1[[#This Row],[Contacted]]=1,\"Not eligible\",IF(Table1[[#This Row],[Identified]]=1,\"Not contacted\",\"\"))))))","v":"Not eligible"},{"$f":"_xlfn.CONCAT(Table1[[#This Row],[Reason not contacted]],Table1[[#This Row],[Reason not eligible]],Table1[[#This Row],[Reason not interested]],Table1[[#This Row],[Reason not enrolled]],Table1[[#This Row],[Reason first service not received]])","v":"Ineligible reason1"}]
[1617,null,"65 yrs +","F","Non-Hispanic/Latino","White","Yes","Yes","No","Not Employed","0 to 1","MSK","Non-work related","Non-workers comp","Industry 3","Occupation 2","Employer","Electronic Health Records","County C","Email",1,0,"No contact info",0,null,0,null,0,null,0,null,"2019-09-20",null,null,null,null,{"$f":"IF(Table1[[#This Row],[First service received]]=1,\"Never dropped\",IF(Table1[[#This Row],[Enrolled]]=1,\"No first service\",IF(Table1[[#This Row],[Expressed interest]]=1,\"Not enrolled\",IF(Table1[[#This Row],[Eligible]]=1,\"Not interested\",IF(Table1[[#This Row],[Contacted]]=1,\"Not eligible\",IF(Table1[[#This Row],[Identified]]=1,\"Not contacted\",\"\"))))))","v":"Not contacted"},{"$f":"_xlfn.CONCAT(Table1[[#This Row],[Reason not contacted]],Table1[[#This Row],[Reason not eligible]],Table1[[#This Row],[Reason not interested]],Table1[[#This Row],[Reason not enrolled]],Table1[[#This Row],[Reason first service not received]])","v":"No contact info"}]
[1267,null,"45 to 64 yrs","M","Hispanic/Latino","White","Yes","Yes","No","Employed","7 to 12","MSK","Work related","Workers comp","Industry 1","Occupation 1","Employer","Electronic Health Records","County B","In person",1,1,null,0,"Ineligible reason3",0,null,0,null,0,null,"2019-09-21","2019-09-24","2019-10-22",null,null,{"$f":"IF(Table1[[#This Row],[First service received]]=1,\"Never dropped\",IF(Table1[[#This Row],[Enrolled]]=1,\"No first service\",IF(Table1[[#This Row],[Expressed interest]]=1,\"Not enrolled\",IF(Table1[[#This Row],[Eligible]]=1,\"Not interested\",IF(Table1[[#This Row],[Contacted]]=1,\"Not eligible\",IF(Table1[[#This Row],[Identified]]=1,\"Not contacted\",\"\"))))))","v":"Not eligible"},{"$f":"_xlfn.CONCAT(Table1[[#This Row],[Reason not contacted]],Table1[[#This Row],[Reason not eligible]],Table1[[#This Row],[Reason not interested]],Table1[[#This Row],[Reason not enrolled]],Table1[[#This Row],[Reason first service not received]])","v":"Ineligible reason3"}]
[1033,null,"25 to 44 yrs","F","Non-Hispanic/Latino","White","Yes","Yes","No","Not Employed","0 to 1","MSK","Work related","Non-workers comp","Industry 1","Occupation 1","Health provider","Voc rehab centers","County B","Phone",1,1,null,1,null,0,"Impact on provider relationship",0,null,0,null,"2019-09-22","2019-10-06","2019-11-02",null,null,{"$f":"IF(Table1[[#This Row],[First service received]]=1,\"Never dropped\",IF(Table1[[#This Row],[Enrolled]]=1,\"No first service\",IF(Table1[[#This Row],[Expressed interest]]=1,\"Not enrolled\",IF(Table1[[#This Row],[Eligible]]=1,\"Not interested\",IF(Table1[[#This Row],[Contacted]]=1,\"Not eligible\",IF(Table1[[#This Row],[Identified]]=1,\"Not contacted\",\"\"))))))","v":"Not interested"},{"$f":"_xlfn.CONCAT(Table1[[#This Row],[Reason not contacted]],Table1[[#This Row],[Reason not eligible]],Table1[[#This Row],[Reason not interested]],Table1[[#This Row],[Reason not enrolled]],Table1[[#This Row],[Reason first service not received]])","v":"Impact on provider relationship"}]
[1082,null,"25 to 44 yrs","F","Non-Hispanic/Latino","White","No","Yes","No","Not Employed","0 to 1","MSK","Non-work related","Non-workers comp","Industry 1","Occupation 3","Employer","Electronic Health Records","County C","In person",1,0,"Contacted, no response",0,null,0,null,0,null,0,null,"2019-09-22",null,null,null,null,{"$f":"IF(Table1[[#This Row],[First service received]]=1,\"Never dropped\",IF(Table1[[#This Row],[Enrolled]]=1,\"No first service\",IF(Table1[[#This Row],[Expressed interest]]=1,\"Not enrolled\",IF(Table1[[#This Row],[Eligible]]=1,\"Not interested\",IF(Table1[[#This Row],[Contacted]]=1,\"Not eligible\",IF(Table1[[#This Row],[Identified]]=1,\"Not contacted\",\"\"))))))","v":"Not contacted"},{"$f":"_xlfn.CONCAT(Table1[[#This Row],[Reason not contacted]],Table1[[#This Row],[Reason not eligible]],Table1[[#This Row],[Reason not interested]],Table1[[#This Row],[Reason not enrolled]],Table1[[#This Row],[Reason first service not received]])","v":"Contacted, no response"}]
[1147,null,"45 to 64 yrs","F","Non-Hispanic/Latino","White","No","Yes","No","Employed","2 to 6","MSK","Work related","Workers comp","Industry 4","Occupation 3","Health provider","Work restriction forms","County B","Email",1,1,null,0,"Ineligible reason3",0,null,0,null,0,null,"2019-09-22","2019-10-06","2019-11-09",null,null,{"$f":"IF(Table1[[#This Row],[First service received]]=1,\"Never dropped\",IF(Table1[[#This Row],[Enrolled]]=1,\"No first service\",IF(Table1[[#This Row],[Expressed interest]]=1,\"Not enrolled\",IF(Table1[[#This Row],[Eligible]]=1,\"Not interested\",IF(Table1[[#This Row],[Contacted]]=1,\"Not eligible\",IF(Table1[[#This Row],[Identified]]=1,\"Not contacted\",\"\"))))))","v":"Not eligible"},{"$f":"_xlfn.CONCAT(Table1[[#This Row],[Reason not contacted]],Table1[[#This Row],[Reason not eligible]],Table1[[#This Row],[Reason not interested]],Table1[[#This Row],[Reason not enrolled]],Table1[[#This Row],[Reason first service not received]])","v":"Ineligible reason3"}]
[1307,null,"25 to 44 yrs","M","Non-Hispanic/Latino","White","Yes","Yes","No","Not Employed","0 to 1","Cardio or Respiratory","Non-work related","Non-workers comp","Industry 3","Occupation 2","Self","Electronic Health Records","County C","In person",1,1,null,1,null,0,"Impact on provider relationship",0,null,0,null,"2019-09-22","2019-10-04","2019-11-11",null,null,{"$f":"IF(Table1[[#This Row],[First service received]]=1,\"Never dropped\",IF(Table1[[#This Row],[Enrolled]]=1,\"No first service\",IF(Table1[[#This Row],[Expressed interest]]=1,\"Not enrolled\",IF(Table1[[#This Row],[Eligible]]=1,\"Not interested\",IF(Table1[[#This Row],[Contacted]]=1,\"Not eligible\",IF(Table1[[#This Row],[Identified]]=1,\"Not contacted\",\"\"))))))","v":"Not interested"},{"$f":"_xlfn.CONCAT(Table1[[#This Row],[Reason not contacted]],Table1[[#This Row],[Reason not eligible]],Table1[[#This Row],[Reason not interested]],Table1[[#This Row],[Reason not enrolled]],Table1[[#This Row],[Reason first service not received]])","v":"Impact on provider relationship"}]
[1358,null,"25 to 44 yrs","F","Non-Hispanic/Latino","White","No","No","No","Employed","0 to 1","Cardio or Respiratory","Work related","Non-workers comp","Industry 2","Occupation 3","Health provider","FMLA forms","County B","Phone",1,1,null,1,null,0,"Don't want to be in research study",0,null,0,null,"2019-09-22","2019-09-29","2019-10-16",null,null,{"$f":"IF(Table1[[#This Row],[First service received]]=1,\"Never dropped\",IF(Table1[[#This Row],[Enrolled]]=1,\"No first service\",IF(Table1[[#This Row],[Expressed interest]]=1,\"Not enrolled\",IF(Table1[[#This Row],[Eligible]]=1,\"Not interested\",IF(Table1[[#This Row],[Contacted]]=1,\"Not eligible\",IF(Table1[[#This Row],[Identified]]=1,\"Not contacted\",\"\"))))))","v":"Not interested"},{"$f":"_xlfn.CONCAT(Table1[[#This Row],[Reason not contacted]],Table1[[#This Row],[Reason not eligible]],Table1[[#This Row],[Reason not interested]],Table1[[#This Row],[Reason not enrolled]],Table1[[#This Row],[Reason first service not received]])","v":"Don't want to be in research study"}]
[1484,null,"25 to 44 yrs","F","Non-Hispanic/Latino","Black or African-American","Yes","No","No","Employed","2 to 6","MSK","Non-work related","Non-workers comp","Industry 2","Occupation 3","Workforce partner","Electronic Health Records","County B","Email",1,1,null,1,null,0,"Don't want to be in research study",0,null,0,null,"2019-09-22","2019-10-01","2019-10-19",null,null,{"$f":"IF(Table1[[#This Row],[First service received]]=1,\"Never dropped\",IF(Table1[[#This Row],[Enrolled]]=1,\"No first service\",IF(Table1[[#This Row],[Expressed interest]]=1,\"Not enrolled\",IF(Table1[[#This Row],[Eligible]]=1,\"Not interested\",IF(Table1[[#This Row],[Contacted]]=1,\"Not eligible\",IF(Table1[[#This Row],[Identified]]=1,\"Not contacted\",\"\"))))))","v":"Not interested"},{"$f":"_xlfn.CONCAT(Table1[[#This Row],[Reason not contacted]],Table1[[#This Row],[Reason not eligible]],Table1[[#This Row],[Reason not interested]],Table1[[#This Row],[Reason not enrolled]],Table1[[#This Row],[Reason first service not received]])","v":"Don't want to be in research study"}]
[1525,null,"45 to 64 yrs","F","Hispanic/Latino","White","Yes","Yes","No","Not Employed","0 to 1","MSK","Work related","Workers comp","Industry 1","Occupation 3","Workforce partner","Electronic Health Records","County B","Phone",1,1,null,1,null,0,"Concerned about employer' perception",0,null,0,null,"2019-09-22","2019-09-26","2019-10-16",null,null,{"$f":"IF(Table1[[#This Row],[First service received]]=1,\"Never dropped\",IF(Table1[[#This Row],[Enrolled]]=1,\"No first service\",IF(Table1[[#This Row],[Expressed interest]]=1,\"Not enrolled\",IF(Table1[[#This Row],[Eligible]]=1,\"Not interested\",IF(Table1[[#This Row],[Contacted]]=1,\"Not eligible\",IF(Table1[[#This Row],[Identified]]=1,\"Not contacted\",\"\"))))))","v":"Not interested"},{"$f":"_xlfn.CONCAT(Table1[[#This Row],[Reason not contacted]],Table1[[#This Row],[Reason not eligible]],Table1[[#This Row],[Reason not interested]],Table1[[#This Row],[Reason not enrolled]],Table1[[#This Row],[Reason first service not received]])","v":"Concerned about employer' perception"}]
[1194,null,"25 to 44 yrs","M","Non-Hispanic/Latino","White","Yes","Yes","No","Employed","7 to 12","Cardio or Respiratory","Non-work related","Non-workers comp","Industry 1","Occupation 3","Self","Electronic Health Records","County B","In person",1,1,null,0,"Ineligible reason2",0,null,0,null,0,null,"2019-09-23","2019-10-04","2019-10-25",null,null,{"$f":"IF(Table1[[#This Row],[First service received]]=1,\"Never dropped\",IF(Table1[[#This Row],[Enrolled]]=1,\"No first service\",IF(Table1[[#This Row],[Expressed interest]]=1,\"Not enrolled\",IF(Table1[[#This Row],[Eligible]]=1,\"Not interested\",IF(Table1[[#This Row],[Contacted]]=1,\"Not eligible\",IF(Table1[[#This Row],[Identified]]=1,\"Not contacted\",\"\"))))))","v":"Not eligible"},{"$f":"_xlfn.CONCAT(Table1[[#This Row],[Reason not contacted]],Table1[[#This Row],[Reason not eligible]],Table1[[#This Row],[Reason not interested]],Table1[[#This Row],[Reason not enrolled]],Table1[[#This Row],[Reason first service not received]])","v":"Ineligible reason2"}]
[1227,null,"18 to 24 yrs","F","Non-Hispanic/Latino","White","Yes","Yes","No","Employed","2 to 6","MSK","Non-work related","Non-workers comp","Industry 1","Occupation 1","Health provider","Worker’s comp database","County C","Email",1,1,null,1,null,1,null,1,null,1,null,"2019-09-23","2019-10-08","2019-10-09","2019-11-05","2019-11-16",{"$f":"IF(Table1[[#This Row],[First service received]]=1,\"Never dropped\",IF(Table1[[#This Row],[Enrolled]]=1,\"No first service\",IF(Table1[[#This Row],[Expressed interest]]=1,\"Not enrolled\",IF(Table1[[#This Row],[Eligible]]=1,\"Not interested\",IF(Table1[[#This Row],[Contacted]]=1,\"Not eligible\",IF(Table1[[#This Row],[Identified]]=1,\"Not contacted\",\"\"))))))","v":"Never dropped"},{"$f":"_xlfn.CONCAT(Table1[[#This Row],[Reason not contacted]],Table1[[#This Row],[Reason not eligible]],Table1[[#This Row],[Reason not interested]],Table1[[#This Row],[Reason not enrolled]],Table1[[#This Row],[Reason first service not received]])","v":""}]
[1300,null,"18 to 24 yrs","F","Non-Hispanic/Latino","White","Yes","Yes","Yes","Not Employed","0 to 1","MSK","Non-work related","Non-workers comp","Industry 3","Occupation 2","Health provider","Worker’s comp database","County B","In person",1,1,null,1,null,1,null,1,null,1,null,"2019-09-23","2019-10-03","2019-10-12","2019-10-22","2019-11-02",{"$f":"IF(Table1[[#This Row],[First service received]]=1,\"Never dropped\",IF(Table1[[#This Row],[Enrolled]]=1,\"No first service\",IF(Table1[[#This Row],[Expressed interest]]=1,\"Not enrolled\",IF(Table1[[#This Row],[Eligible]]=1,\"Not interested\",IF(Table1[[#This Row],[Contacted]]=1,\"Not eligible\",IF(Table1[[#This Row],[Identified]]=1,\"Not contacted\",\"\"))))))","v":"Never dropped"},{"$f":"_xlfn.CONCAT(Table1[[#This Row],[Reason not contacted]],Table1[[#This Row],[Reason not eligible]],Table1[[#This Row],[Reason not interested]],Table1[[#This Row],[Reason not enrolled]],Table1[[#This Row],[Reason first service not received]])","v":""}]
[1301,null,"18 to 24 yrs","F","Non-Hispanic/Latino","White","Yes","Yes","No","Employed","2 to 6","MSK","Non-work related","Non-workers comp","Industry 1","Occupation 1","Health provider","Worker’s comp database","County C","Email",1,1,null,1,null,1,null,1,null,1,null,"2019-09-23","2019-10-08","2019-10-09","2019-11-05","2019-11-16",{"$f":"IF(Table1[[#This Row],[First service received]]=1,\"Never dropped\",IF(Table1[[#This Row],[Enrolled]]=1,\"No first service\",IF(Table1[[#This Row],[Expressed interest]]=1,\"Not enrolled\",IF(Table1[[#This Row],[Eligible]]=1,\"Not interested\",IF(Table1[[#This Row],[Contacted]]=1,\"Not eligible\",IF(Table1[[#This Row],[Identified]]=1,\"Not contacted\",\"\"))))))","v":"Never dropped"},{"$f":"_xlfn.CONCAT(Table1[[#This Row],[Reason not contacted]],Table1[[#This Row],[Reason not eligible]],Table1[[#This Row],[Reason not interested]],Table1[[#This Row],[Reason not enrolled]],Table1[[#This Row],[Reason first service not received]])","v":""}]
[1310,null,"18 to 24 yrs","F","Non-Hispanic/Latino","White","Yes","Yes","Yes","Not Employed","0 to 1","MSK","Non-work related","Non-workers comp","Industry 3","Occupation 2","Health provider","Worker’s comp database","County B","In person",1,1,null,1,null,1,null,1,null,1,null,"2019-09-23","2019-10-03","2019-10-12","2019-10-22","2019-11-02",{"$f":"IF(Table1[[#This Row],[First service received]]=1,\"Never dropped\",IF(Table1[[#This Row],[Enrolled]]=1,\"No first service\",IF(Table1[[#This Row],[Expressed interest]]=1,\"Not enrolled\",IF(Table1[[#This Row],[Eligible]]=1,\"Not interested\",IF(Table1[[#This Row],[Contacted]]=1,\"Not eligible\",IF(Table1[[#This Row],[Identified]]=1,\"Not contacted\",\"\"))))))","v":"Never dropped"},{"$f":"_xlfn.CONCAT(Table1[[#This Row],[Reason not contacted]],Table1[[#This Row],[Reason not eligible]],Table1[[#This Row],[Reason not interested]],Table1[[#This Row],[Reason not enrolled]],Table1[[#This Row],[Reason first service not received]])","v":""}]
[1316,null,"65 yrs +","M","Non-Hispanic/Latino","White","Yes","Yes","No","Employed","7 to 12","MSK","Non-work related","Non-workers comp","Industry 2","Occupation 3","Health provider","Voc rehab centers","County B","Phone",1,0,"Contacted, no response",0,null,0,null,0,null,0,null,"2019-09-23",null,null,null,null,{"$f":"IF(Table1[[#This Row],[First service received]]=1,\"Never dropped\",IF(Table1[[#This Row],[Enrolled]]=1,\"No first service\",IF(Table1[[#This Row],[Expressed interest]]=1,\"Not enrolled\",IF(Table1[[#This Row],[Eligible]]=1,\"Not interested\",IF(Table1[[#This Row],[Contacted]]=1,\"Not eligible\",IF(Table1[[#This Row],[Identified]]=1,\"Not contacted\",\"\"))))))","v":"Not contacted"},{"$f":"_xlfn.CONCAT(Table1[[#This Row],[Reason not contacted]],Table1[[#This Row],[Reason not eligible]],Table1[[#This Row],[Reason not interested]],Table1[[#This Row],[Reason not enrolled]],Table1[[#This Row],[Reason first service not received]])","v":"Contacted, no response"}]
[1347,null,"45 to 64 yrs","F","Non-Hispanic/Latino","American Indian or Alaska Native","Yes","Yes","No","Employed","2 to 6","MSK","Non-work related","Non-workers comp","Industry 1","Occupation 1","Health provider","Worker’s comp database","County B","In person",1,1,null,0,"Ineligible reason3",0,null,0,null,0,null,"2019-09-23","2019-10-02","2019-11-11",null,null,{"$f":"IF(Table1[[#This Row],[First service received]]=1,\"Never dropped\",IF(Table1[[#This Row],[Enrolled]]=1,\"No first service\",IF(Table1[[#This Row],[Expressed interest]]=1,\"Not enrolled\",IF(Table1[[#This Row],[Eligible]]=1,\"Not interested\",IF(Table1[[#This Row],[Contacted]]=1,\"Not eligible\",IF(Table1[[#This Row],[Identified]]=1,\"Not contacted\",\"\"))))))","v":"Not eligible"},{"$f":"_xlfn.CONCAT(Table1[[#This Row],[Reason not contacted]],Table1[[#This Row],[Reason not eligible]],Table1[[#This Row],[Reason not interested]],Table1[[#This Row],[Reason not enrolled]],Table1[[#This Row],[Reason first service not received]])","v":"Ineligible reason3"}]
[1464,null,"45 to 64 yrs","M","Non-Hispanic/Latino","Other or 2 or more","No","No","No","Not Employed","0 to 1","MSK","Work related","Non-workers comp","Industry 3","Occupation 3","Health provider","Work restriction forms","County B","In person",1,1,null,1,null,0,"Impact on provider relationship",0,null,0,null,"2019-09-23","2019-10-05","2019-11-07",null,null,{"$f":"IF(Table1[[#This Row],[First service received]]=1,\"Never dropped\",IF(Table1[[#This Row],[Enrolled]]=1,\"No first service\",IF(Table1[[#This Row],[Expressed interest]]=1,\"Not enrolled\",IF(Table1[[#This Row],[Eligible]]=1,\"Not interested\",IF(Table1[[#This Row],[Contacted]]=1,\"Not eligible\",IF(Table1[[#This Row],[Identified]]=1,\"Not contacted\",\"\"))))))","v":"Not interested"},{"$f":"_xlfn.CONCAT(Table1[[#This Row],[Reason not contacted]],Table1[[#This Row],[Reason not eligible]],Table1[[#This Row],[Reason not interested]],Table1[[#This Row],[Reason not enrolled]],Table1[[#This Row],[Reason first service not received]])","v":"Impact on provider relationship"}]
[1326,null,"65 yrs +","F","Hispanic/Latino","White","No","No","No","Not Employed","0 to 1","Cardio or Respiratory","Non-work related","Non-workers comp","Industry 3","Occupation 2","Health provider","Worker’s comp database","County A","Phone",1,0,"Contacted, no response",0,null,0,null,0,null,0,null,"2019-09-24",null,null,null,null,{"$f":"IF(Table1[[#This Row],[First service received]]=1,\"Never dropped\",IF(Table1[[#This Row],[Enrolled]]=1,\"No first service\",IF(Table1[[#This Row],[Expressed interest]]=1,\"Not enrolled\",IF(Table1[[#This Row],[Eligible]]=1,\"Not interested\",IF(Table1[[#This Row],[Contacted]]=1,\"Not eligible\",IF(Table1[[#This Row],[Identified]]=1,\"Not contacted\",\"\"))))))","v":"Not contacted"},{"$f":"_xlfn.CONCAT(Table1[[#This Row],[Reason not contacted]],Table1[[#This Row],[Reason not eligible]],Table1[[#This Row],[Reason not interested]],Table1[[#This Row],[Reason not enrolled]],Table1[[#This Row],[Reason first service not received]])","v":"Contacted, no response"}]
[1066,null,"45 to 64 yrs","M","Non-Hispanic/Latino","White","No","Yes","No","Employed","7 to 12","Other","Work related","Non-workers comp","Industry 1","Occupation 3","Health provider","Worker’s comp database","County A","Phone",1,1,null,1,null,0,"Don't want to be in research study",0,null,0,null,"2019-09-25","2019-09-27","2019-10-01",null,null,{"$f":"IF(Table1[[#This Row],[First service received]]=1,\"Never dropped\",IF(Table1[[#This Row],[Enrolled]]=1,\"No first service\",IF(Table1[[#This Row],[Expressed interest]]=1,\"Not enrolled\",IF(Table1[[#This Row],[Eligible]]=1,\"Not interested\",IF(Table1[[#This Row],[Contacted]]=1,\"Not eligible\",IF(Table1[[#This Row],[Identified]]=1,\"Not contacted\",\"\"))))))","v":"Not interested"},{"$f":"_xlfn.CONCAT(Table1[[#This Row],[Reason not contacted]],Table1[[#This Row],[Reason not eligible]],Table1[[#This Row],[Reason not interested]],Table1[[#This Row],[Reason not enrolled]],Table1[[#This Row],[Reason first service not received]])","v":"Don't want to be in research study"}]
[1087,null,"25 to 44 yrs","M","Non-Hispanic/Latino","Black or African-American","Yes","Yes","No","Employed","7 to 12","Other","Non-work related","Non-workers comp","Industry 1","Occupation 1","Employer","Electronic Health Records","County B","In person",1,1,null,1,null,1,null,1,null,1,null,"2019-09-26","2019-10-01","2019-10-11","2019-10-27","2019-11-03",{"$f":"IF(Table1[[#This Row],[First service received]]=1,\"Never dropped\",IF(Table1[[#This Row],[Enrolled]]=1,\"No first service\",IF(Table1[[#This Row],[Expressed interest]]=1,\"Not enrolled\",IF(Table1[[#This Row],[Eligible]]=1,\"Not interested\",IF(Table1[[#This Row],[Contacted]]=1,\"Not eligible\",IF(Table1[[#This Row],[Identified]]=1,\"Not contacted\",\"\"))))))","v":"Never dropped"},{"$f":"_xlfn.CONCAT(Table1[[#This Row],[Reason not contacted]],Table1[[#This Row],[Reason not eligible]],Table1[[#This Row],[Reason not interested]],Table1[[#This Row],[Reason not enrolled]],Table1[[#This Row],[Reason first service not received]])","v":""}]
[1165,null,"25 to 44 yrs","M","Non-Hispanic/Latino","White","Yes","Yes","No","Employed","13+ weeks","MSK","Non-work related","Non-workers comp","Industry 3","Occupation 2","Health provider","Work restriction forms","County A","In person",1,1,null,1,null,0,"Don't want to be in research study",0,null,0,null,"2019-09-26","2019-10-07","2019-11-05",null,null,{"$f":"IF(Table1[[#This Row],[First service received]]=1,\"Never dropped\",IF(Table1[[#This Row],[Enrolled]]=1,\"No first service\",IF(Table1[[#This Row],[Expressed interest]]=1,\"Not enrolled\",IF(Table1[[#This Row],[Eligible]]=1,\"Not interested\",IF(Table1[[#This Row],[Contacted]]=1,\"Not eligible\",IF(Table1[[#This Row],[Identified]]=1,\"Not contacted\",\"\"))))))","v":"Not interested"},{"$f":"_xlfn.CONCAT(Table1[[#This Row],[Reason not contacted]],Table1[[#This Row],[Reason not eligible]],Table1[[#This Row],[Reason not interested]],Table1[[#This Row],[Reason not enrolled]],Table1[[#This Row],[Reason first service not received]])","v":"Don't want to be in research study"}]
[1381,null,"25 to 44 yrs","M","Non-Hispanic/Latino","Black or African-American","Yes","Yes","No","Employed","7 to 12","Other","Non-work related","Non-workers comp","Industry 1","Occupation 1","Employer","Electronic Health Records","County B","In person",1,1,null,1,null,1,null,1,null,1,null,"2019-09-26","2019-10-01","2019-10-11","2019-10-27","2019-11-03",{"$f":"IF(Table1[[#This Row],[First service received]]=1,\"Never dropped\",IF(Table1[[#This Row],[Enrolled]]=1,\"No first service\",IF(Table1[[#This Row],[Expressed interest]]=1,\"Not enrolled\",IF(Table1[[#This Row],[Eligible]]=1,\"Not interested\",IF(Table1[[#This Row],[Contacted]]=1,\"Not eligible\",IF(Table1[[#This Row],[Identified]]=1,\"Not contacted\",\"\"))))))","v":"Never dropped"},{"$f":"_xlfn.CONCAT(Table1[[#This Row],[Reason not contacted]],Table1[[#This Row],[Reason not eligible]],Table1[[#This Row],[Reason not interested]],Table1[[#This Row],[Reason not enrolled]],Table1[[#This Row],[Reason first service not received]])","v":""}]
[1016,null,"18 to 24 yrs","F","Non-Hispanic/Latino","White","Yes","Yes","No","Employed","7 to 12","Other","Work related","Workers comp","Industry 1","Occupation 3","Health provider","Worker’s comp database","County B","Email",1,1,null,1,null,1,null,1,null,1,null,"2019-09-27","2019-10-03","2019-10-09","2019-10-30","2019-11-13",{"$f":"IF(Table1[[#This Row],[First service received]]=1,\"Never dropped\",IF(Table1[[#This Row],[Enrolled]]=1,\"No first service\",IF(Table1[[#This Row],[Expressed interest]]=1,\"Not enrolled\",IF(Table1[[#This Row],[Eligible]]=1,\"Not interested\",IF(Table1[[#This Row],[Contacted]]=1,\"Not eligible\",IF(Table1[[#This Row],[Identified]]=1,\"Not contacted\",\"\"))))))","v":"Never dropped"},{"$f":"_xlfn.CONCAT(Table1[[#This Row],[Reason not contacted]],Table1[[#This Row],[Reason not eligible]],Table1[[#This Row],[Reason not interested]],Table1[[#This Row],[Reason not enrolled]],Table1[[#This Row],[Reason first service not received]])","v":""}]
[1395,null,"65 yrs +","M","Non-Hispanic/Latino","White","Yes","Yes","No","Employed","0 to 1","Cardio or Respiratory","Work related","Workers comp","Industry 4","Occupation 3","Employer","Electronic Health Records","County B","Phone",1,1,null,1,null,0,"Impact on provider relationship",0,null,0,null,"2019-09-27","2019-10-02","2019-10-29",null,null,{"$f":"IF(Table1[[#This Row],[First service received]]=1,\"Never dropped\",IF(Table1[[#This Row],[Enrolled]]=1,\"No first service\",IF(Table1[[#This Row],[Expressed interest]]=1,\"Not enrolled\",IF(Table1[[#This Row],[Eligible]]=1,\"Not interested\",IF(Table1[[#This Row],[Contacted]]=1,\"Not eligible\",IF(Table1[[#This Row],[Identified]]=1,\"Not contacted\",\"\"))))))","v":"Not interested"},{"$f":"_xlfn.CONCAT(Table1[[#This Row],[Reason not contacted]],Table1[[#This Row],[Reason not eligible]],Table1[[#This Row],[Reason not interested]],Table1[[#This Row],[Reason not enrolled]],Table1[[#This Row],[Reason first service not received]])","v":"Impact on provider relationship"}]
[1397,null,"18 to 24 yrs","F","Non-Hispanic/Latino","White","Yes","Yes","No","Employed","7 to 12","Other","Work related","Workers comp","Industry 1","Occupation 3","Health provider","Worker’s comp database","County B","Email",1,1,null,1,null,1,null,1,null,1,null,"2019-09-27","2019-10-03","2019-10-09","2019-10-30","2019-11-13",{"$f":"IF(Table1[[#This Row],[First service received]]=1,\"Never dropped\",IF(Table1[[#This Row],[Enrolled]]=1,\"No first service\",IF(Table1[[#This Row],[Expressed interest]]=1,\"Not enrolled\",IF(Table1[[#This Row],[Eligible]]=1,\"Not interested\",IF(Table1[[#This Row],[Contacted]]=1,\"Not eligible\",IF(Table1[[#This Row],[Identified]]=1,\"Not contacted\",\"\"))))))","v":"Never dropped"},{"$f":"_xlfn.CONCAT(Table1[[#This Row],[Reason not contacted]],Table1[[#This Row],[Reason not eligible]],Table1[[#This Row],[Reason not interested]],Table1[[#This Row],[Reason not enrolled]],Table1[[#This Row],[Reason first service not received]])","v":""}]
[1404,null,"25 to 44 yrs","M","Hispanic/Latino","White","Yes","Yes","No","Self-employed","13+ weeks","MSK","Non-work related","Non-workers comp","Industry 4","Occupation 3","Health provider","Worker’s comp database","County B","Phone",1,1,null,0,"Ineligible reason2",0,null,0,null,0,null,"2019-09-27","2019-10-05","2019-10-11",null,null,{"$f":"IF(Table1[[#This Row],[First service received]]=1,\"Never dropped\",IF(Table1[[#This Row],[Enrolled]]=1,\"No first service\",IF(Table1[[#This Row],[Expressed interest]]=1,\"Not enrolled\",IF(Table1[[#This Row],[Eligible]]=1,\"Not interested\",IF(Table1[[#This Row],[Contacted]]=1,\"Not eligible\",IF(Table1[[#This Row],[Identified]]=1,\"Not contacted\",\"\"))))))","v":"Not eligible"},{"$f":"_xlfn.CONCAT(Table1[[#This Row],[Reason not contacted]],Table1[[#This Row],[Reason not eligible]],Table1[[#This Row],[Reason not interested]],Table1[[#This Row],[Reason not enrolled]],Table1[[#This Row],[Reason first service not received]])","v":"Ineligible reason2"}]
[1594,null,"45 to 64 yrs","M","Non-Hispanic/Latino","Black or African-American","Yes","Yes","No","Not Employed","0 to 1","MSK","Non-work related","Non-workers comp","Industry 1","Occupation 3","Self","Electronic Health Records","County B","Phone",1,1,null,1,null,0,"Don't want to be in research study",0,null,0,null,"2019-09-27","2019-10-03","2019-10-06",null,null,{"$f":"IF(Table1[[#This Row],[First service received]]=1,\"Never dropped\",IF(Table1[[#This Row],[Enrolled]]=1,\"No first service\",IF(Table1[[#This Row],[Expressed interest]]=1,\"Not enrolled\",IF(Table1[[#This Row],[Eligible]]=1,\"Not interested\",IF(Table1[[#This Row],[Contacted]]=1,\"Not eligible\",IF(Table1[[#This Row],[Identified]]=1,\"Not contacted\",\"\"))))))","v":"Not interested"},{"$f":"_xlfn.CONCAT(Table1[[#This Row],[Reason not contacted]],Table1[[#This Row],[Reason not eligible]],Table1[[#This Row],[Reason not interested]],Table1[[#This Row],[Reason not enrolled]],Table1[[#This Row],[Reason first service not received]])","v":"Don't want to be in research study"}]
[1012,"lorem ipsum","45 to 64 yrs","F","Non-Hispanic/Latino","American Indian or Alaska Native","Yes","Yes","No","Employed","7 to 12","MSK","Non-work related","Non-workers comp","Industry 1","Occupation 3","Employer","Electronic Health Records","County B","Phone",1,1,null,1,null,1,null,0,"Not enrolled reason1",0,null,"2019-09-28","2019-10-05","2019-11-14",null,null,{"$f":"IF(Table1[[#This Row],[First service received]]=1,\"Never dropped\",IF(Table1[[#This Row],[Enrolled]]=1,\"No first service\",IF(Table1[[#This Row],[Expressed interest]]=1,\"Not enrolled\",IF(Table1[[#This Row],[Eligible]]=1,\"Not interested\",IF(Table1[[#This Row],[Contacted]]=1,\"Not eligible\",IF(Table1[[#This Row],[Identified]]=1,\"Not contacted\",\"\"))))))","v":"Not enrolled"},{"$f":"_xlfn.CONCAT(Table1[[#This Row],[Reason not contacted]],Table1[[#This Row],[Reason not eligible]],Table1[[#This Row],[Reason not interested]],Table1[[#This Row],[Reason not enrolled]],Table1[[#This Row],[Reason first service not received]])","v":"Not enrolled reason1"}]
[1056,null,"45 to 64 yrs","M","Non-Hispanic/Latino","Other or 2 or more","Yes","Yes","No","Employed","2 to 6","Other","Non-work related","Non-workers comp","Industry 4","Occupation 3","Employer","Electronic Health Records","County C","In person",1,1,null,1,null,1,null,1,null,1,null,"2019-09-28","2019-10-04","2019-10-15","2019-10-23","2019-11-05",{"$f":"IF(Table1[[#This Row],[First service received]]=1,\"Never dropped\",IF(Table1[[#This Row],[Enrolled]]=1,\"No first service\",IF(Table1[[#This Row],[Expressed interest]]=1,\"Not enrolled\",IF(Table1[[#This Row],[Eligible]]=1,\"Not interested\",IF(Table1[[#This Row],[Contacted]]=1,\"Not eligible\",IF(Table1[[#This Row],[Identified]]=1,\"Not contacted\",\"\"))))))","v":"Never dropped"},{"$f":"_xlfn.CONCAT(Table1[[#This Row],[Reason not contacted]],Table1[[#This Row],[Reason not eligible]],Table1[[#This Row],[Reason not interested]],Table1[[#This Row],[Reason not enrolled]],Table1[[#This Row],[Reason first service not received]])","v":""}]
[1057,null,"25 to 44 yrs","M","Non-Hispanic/Latino","Black or African-American","Yes","Yes","No","Employed","7 to 12","MSK","Non-work related","Non-workers comp","Industry 1","Occupation 3","Health provider","Worker’s comp database","County A","Phone",1,1,null,1,null,0,"Don't want to be in research study",0,null,0,null,"2019-09-28","2019-10-09","2019-10-14",null,null,{"$f":"IF(Table1[[#This Row],[First service received]]=1,\"Never dropped\",IF(Table1[[#This Row],[Enrolled]]=1,\"No first service\",IF(Table1[[#This Row],[Expressed interest]]=1,\"Not enrolled\",IF(Table1[[#This Row],[Eligible]]=1,\"Not interested\",IF(Table1[[#This Row],[Contacted]]=1,\"Not eligible\",IF(Table1[[#This Row],[Identified]]=1,\"Not contacted\",\"\"))))))","v":"Not interested"},{"$f":"_xlfn.CONCAT(Table1[[#This Row],[Reason not contacted]],Table1[[#This Row],[Reason not eligible]],Table1[[#This Row],[Reason not interested]],Table1[[#This Row],[Reason not enrolled]],Table1[[#This Row],[Reason first service not received]])","v":"Don't want to be in research study"}]
[1070,null,"45 to 64 yrs","M","Hispanic/Latino","White","Yes","Yes","No","Employed","2 to 6","MSK","Non-work related","Non-workers comp","Industry 4","Occupation 3","Employer","Electronic Health Records","County B","Email",1,1,null,1,null,1,null,1,null,1,null,"2019-09-28","2019-10-05","2019-10-08","2019-11-01","2019-11-02",{"$f":"IF(Table1[[#This Row],[First service received]]=1,\"Never dropped\",IF(Table1[[#This Row],[Enrolled]]=1,\"No first service\",IF(Table1[[#This Row],[Expressed interest]]=1,\"Not enrolled\",IF(Table1[[#This Row],[Eligible]]=1,\"Not interested\",IF(Table1[[#This Row],[Contacted]]=1,\"Not eligible\",IF(Table1[[#This Row],[Identified]]=1,\"Not contacted\",\"\"))))))","v":"Never dropped"},{"$f":"_xlfn.CONCAT(Table1[[#This Row],[Reason not contacted]],Table1[[#This Row],[Reason not eligible]],Table1[[#This Row],[Reason not interested]],Table1[[#This Row],[Reason not enrolled]],Table1[[#This Row],[Reason first service not received]])","v":""}]
[1182,null,"25 to 44 yrs","M","Non-Hispanic/Latino","White","No","Yes","No","Employed","7 to 12","MSK","Non-work related","Non-workers comp","Industry 4","Occupation 3","Health provider","Worker’s comp database","County B","In person",1,1,null,1,null,0,"Impact on provider relationship",0,null,0,null,"2019-09-28","2019-10-12","2019-10-24",null,null,{"$f":"IF(Table1[[#This Row],[First service received]]=1,\"Never dropped\",IF(Table1[[#This Row],[Enrolled]]=1,\"No first service\",IF(Table1[[#This Row],[Expressed interest]]=1,\"Not enrolled\",IF(Table1[[#This Row],[Eligible]]=1,\"Not interested\",IF(Table1[[#This Row],[Contacted]]=1,\"Not eligible\",IF(Table1[[#This Row],[Identified]]=1,\"Not contacted\",\"\"))))))","v":"Not interested"},{"$f":"_xlfn.CONCAT(Table1[[#This Row],[Reason not contacted]],Table1[[#This Row],[Reason not eligible]],Table1[[#This Row],[Reason not interested]],Table1[[#This Row],[Reason not enrolled]],Table1[[#This Row],[Reason first service not received]])","v":"Impact on provider relationship"}]
[1214,null,"45 to 64 yrs","F","Non-Hispanic/Latino","White","Yes","Yes","No","Employed","2 to 6","MSK","Non-work related","Non-workers comp","Industry 1","Occupation 1","Self","Electronic Health Records","County B","Email",1,1,null,1,null,1,null,1,null,1,null,"2019-09-28","2019-10-06","2019-10-13","2019-11-01","2019-11-13",{"$f":"IF(Table1[[#This Row],[First service received]]=1,\"Never dropped\",IF(Table1[[#This Row],[Enrolled]]=1,\"No first service\",IF(Table1[[#This Row],[Expressed interest]]=1,\"Not enrolled\",IF(Table1[[#This Row],[Eligible]]=1,\"Not interested\",IF(Table1[[#This Row],[Contacted]]=1,\"Not eligible\",IF(Table1[[#This Row],[Identified]]=1,\"Not contacted\",\"\"))))))","v":"Never dropped"},{"$f":"_xlfn.CONCAT(Table1[[#This Row],[Reason not contacted]],Table1[[#This Row],[Reason not eligible]],Table1[[#This Row],[Reason not interested]],Table1[[#This Row],[Reason not enrolled]],Table1[[#This Row],[Reason first service not received]])","v":""}]
[1331,null,"25 to 44 yrs","F","Hispanic/Latino","White","Yes","Yes","No","Not Employed","0 to 1","MSK","Non-work related","Non-workers comp","Industry 3","Occupation 2","Health provider","Worker’s comp database","County A","Phone",1,0,"Contacted, no response",0,null,0,null,0,null,0,null,"2019-09-28",null,null,null,null,{"$f":"IF(Table1[[#This Row],[First service received]]=1,\"Never dropped\",IF(Table1[[#This Row],[Enrolled]]=1,\"No first service\",IF(Table1[[#This Row],[Expressed interest]]=1,\"Not enrolled\",IF(Table1[[#This Row],[Eligible]]=1,\"Not interested\",IF(Table1[[#This Row],[Contacted]]=1,\"Not eligible\",IF(Table1[[#This Row],[Identified]]=1,\"Not contacted\",\"\"))))))","v":"Not contacted"},{"$f":"_xlfn.CONCAT(Table1[[#This Row],[Reason not contacted]],Table1[[#This Row],[Reason not eligible]],Table1[[#This Row],[Reason not interested]],Table1[[#This Row],[Reason not enrolled]],Table1[[#This Row],[Reason first service not received]])","v":"Contacted, no response"}]
[1362,null,"45 to 64 yrs","M","Non-Hispanic/Latino","Other or 2 or more","Yes","Yes","No","Employed","2 to 6","Other","Non-work related","Non-workers comp","Industry 4","Occupation 3","Employer","Electronic Health Records","County C","In person",1,1,null,1,null,1,null,1,null,1,null,"2019-09-28","2019-10-04","2019-10-15","2019-10-23","2019-11-05",{"$f":"IF(Table1[[#This Row],[First service received]]=1,\"Never dropped\",IF(Table1[[#This Row],[Enrolled]]=1,\"No first service\",IF(Table1[[#This Row],[Expressed interest]]=1,\"Not enrolled\",IF(Table1[[#This Row],[Eligible]]=1,\"Not interested\",IF(Table1[[#This Row],[Contacted]]=1,\"Not eligible\",IF(Table1[[#This Row],[Identified]]=1,\"Not contacted\",\"\"))))))","v":"Never dropped"},{"$f":"_xlfn.CONCAT(Table1[[#This Row],[Reason not contacted]],Table1[[#This Row],[Reason not eligible]],Table1[[#This Row],[Reason not interested]],Table1[[#This Row],[Reason not enrolled]],Table1[[#This Row],[Reason first service not received]])","v":""}]
[1369,null,"45 to 64 yrs","F","Non-Hispanic/Latino","White","Yes","Yes","No","Employed","2 to 6","MSK","Non-work related","Non-workers comp","Industry 1","Occupation 1","Self","Electronic Health Records","County B","Email",1,1,null,1,null,1,null,1,null,1,null,"2019-09-28","2019-10-06","2019-10-13","2019-11-01","2019-11-13",{"$f":"IF(Table1[[#This Row],[First service received]]=1,\"Never dropped\",IF(Table1[[#This Row],[Enrolled]]=1,\"No first service\",IF(Table1[[#This Row],[Expressed interest]]=1,\"Not enrolled\",IF(Table1[[#This Row],[Eligible]]=1,\"Not interested\",IF(Table1[[#This Row],[Contacted]]=1,\"Not eligible\",IF(Table1[[#This Row],[Identified]]=1,\"Not contacted\",\"\"))))))","v":"Never dropped"},{"$f":"_xlfn.CONCAT(Table1[[#This Row],[Reason not contacted]],Table1[[#This Row],[Reason not eligible]],Table1[[#This Row],[Reason not interested]],Table1[[#This Row],[Reason not enrolled]],Table1[[#This Row],[Reason first service not received]])","v":""}]
[1402,null,"45 to 64 yrs","M","Hispanic/Latino","White","Yes","Yes","No","Employed","2 to 6","MSK","Non-work related","Non-workers comp","Industry 4","Occupation 3","Employer","Electronic Health Records","County B","Email",1,1,null,1,null,1,null,1,null,1,null,"2019-09-28","2019-10-05","2019-10-08","2019-11-01","2019-11-02",{"$f":"IF(Table1[[#This Row],[First service received]]=1,\"Never dropped\",IF(Table1[[#This Row],[Enrolled]]=1,\"No first service\",IF(Table1[[#This Row],[Expressed interest]]=1,\"Not enrolled\",IF(Table1[[#This Row],[Eligible]]=1,\"Not interested\",IF(Table1[[#This Row],[Contacted]]=1,\"Not eligible\",IF(Table1[[#This Row],[Identified]]=1,\"Not contacted\",\"\"))))))","v":"Never dropped"},{"$f":"_xlfn.CONCAT(Table1[[#This Row],[Reason not contacted]],Table1[[#This Row],[Reason not eligible]],Table1[[#This Row],[Reason not interested]],Table1[[#This Row],[Reason not enrolled]],Table1[[#This Row],[Reason first service not received]])","v":""}]
[1571,null,"65 yrs +","F","Hispanic/Latino","White","Yes","Yes","No","Employed","2 to 6","MSK","Non-work related","Non-workers comp","Industry 1","Occupation 3","Health provider","FMLA forms","County C","Phone",1,1,null,0,"Ineligible reason1",0,null,0,null,0,null,"2019-09-28","2019-09-30","2019-10-11",null,null,{"$f":"IF(Table1[[#This Row],[First service received]]=1,\"Never dropped\",IF(Table1[[#This Row],[Enrolled]]=1,\"No first service\",IF(Table1[[#This Row],[Expressed interest]]=1,\"Not enrolled\",IF(Table1[[#This Row],[Eligible]]=1,\"Not interested\",IF(Table1[[#This Row],[Contacted]]=1,\"Not eligible\",IF(Table1[[#This Row],[Identified]]=1,\"Not contacted\",\"\"))))))","v":"Not eligible"},{"$f":"_xlfn.CONCAT(Table1[[#This Row],[Reason not contacted]],Table1[[#This Row],[Reason not eligible]],Table1[[#This Row],[Reason not interested]],Table1[[#This Row],[Reason not enrolled]],Table1[[#This Row],[Reason first service not received]])","v":"Ineligible reason1"}]
[1614,null,"45 to 64 yrs","M","Hispanic/Latino","White","Yes","Yes","No","Not Employed","0 to 1","Other","Non-work related","Non-workers comp","Industry 3","Occupation 2","Workforce partner","Electronic Health Records","County B","Phone",1,0,"Contacted, no response",0,null,0,null,0,null,0,null,"2019-09-28",null,null,null,null,{"$f":"IF(Table1[[#This Row],[First service received]]=1,\"Never dropped\",IF(Table1[[#This Row],[Enrolled]]=1,\"No first service\",IF(Table1[[#This Row],[Expressed interest]]=1,\"Not enrolled\",IF(Table1[[#This Row],[Eligible]]=1,\"Not interested\",IF(Table1[[#This Row],[Contacted]]=1,\"Not eligible\",IF(Table1[[#This Row],[Identified]]=1,\"Not contacted\",\"\"))))))","v":"Not contacted"},{"$f":"_xlfn.CONCAT(Table1[[#This Row],[Reason not contacted]],Table1[[#This Row],[Reason not eligible]],Table1[[#This Row],[Reason not interested]],Table1[[#This Row],[Reason not enrolled]],Table1[[#This Row],[Reason first service not received]])","v":"Contacted, no response"}]
[1036,null,"25 to 44 yrs","M","Non-Hispanic/Latino","White","Yes","Yes","No","Not Employed","0 to 1","MSK","Non-work related","Non-workers comp","Industry 4","Occupation 3","Health provider","Clinic appointment schedules","County B","Phone",1,1,null,1,null,1,null,1,null,1,null,"2019-09-29","2019-10-03","2019-10-08","2019-10-17","2019-10-20",{"$f":"IF(Table1[[#This Row],[First service received]]=1,\"Never dropped\",IF(Table1[[#This Row],[Enrolled]]=1,\"No first service\",IF(Table1[[#This Row],[Expressed interest]]=1,\"Not enrolled\",IF(Table1[[#This Row],[Eligible]]=1,\"Not interested\",IF(Table1[[#This Row],[Contacted]]=1,\"Not eligible\",IF(Table1[[#This Row],[Identified]]=1,\"Not contacted\",\"\"))))))","v":"Never dropped"},{"$f":"_xlfn.CONCAT(Table1[[#This Row],[Reason not contacted]],Table1[[#This Row],[Reason not eligible]],Table1[[#This Row],[Reason not interested]],Table1[[#This Row],[Reason not enrolled]],Table1[[#This Row],[Reason first service not received]])","v":""}]
[1296,null,"25 to 44 yrs","M","Non-Hispanic/Latino","White","Yes","Yes","No","Not Employed","0 to 1","MSK","Non-work related","Non-workers comp","Industry 4","Occupation 3","Health provider","Clinic appointment schedules","County B","Phone",1,1,null,1,null,1,null,1,null,1,null,"2019-09-29","2019-10-03","2019-10-08","2019-10-17","2019-10-20",{"$f":"IF(Table1[[#This Row],[First service received]]=1,\"Never dropped\",IF(Table1[[#This Row],[Enrolled]]=1,\"No first service\",IF(Table1[[#This Row],[Expressed interest]]=1,\"Not enrolled\",IF(Table1[[#This Row],[Eligible]]=1,\"Not interested\",IF(Table1[[#This Row],[Contacted]]=1,\"Not eligible\",IF(Table1[[#This Row],[Identified]]=1,\"Not contacted\",\"\"))))))","v":"Never dropped"},{"$f":"_xlfn.CONCAT(Table1[[#This Row],[Reason not contacted]],Table1[[#This Row],[Reason not eligible]],Table1[[#This Row],[Reason not interested]],Table1[[#This Row],[Reason not enrolled]],Table1[[#This Row],[Reason first service not received]])","v":""}]
[1367,null,"45 to 64 yrs","F","Non-Hispanic/Latino","White","Yes","Yes","No","Employed","2 to 6","MSK","Work related","Workers comp","Industry 1","Occupation 3","Health provider","Worker’s comp database","County A","Email",1,1,null,1,null,0,"Don't want to be in research study",0,null,0,null,"2019-09-29","2019-10-12","2019-11-05",null,null,{"$f":"IF(Table1[[#This Row],[First service received]]=1,\"Never dropped\",IF(Table1[[#This Row],[Enrolled]]=1,\"No first service\",IF(Table1[[#This Row],[Expressed interest]]=1,\"Not enrolled\",IF(Table1[[#This Row],[Eligible]]=1,\"Not interested\",IF(Table1[[#This Row],[Contacted]]=1,\"Not eligible\",IF(Table1[[#This Row],[Identified]]=1,\"Not contacted\",\"\"))))))","v":"Not interested"},{"$f":"_xlfn.CONCAT(Table1[[#This Row],[Reason not contacted]],Table1[[#This Row],[Reason not eligible]],Table1[[#This Row],[Reason not interested]],Table1[[#This Row],[Reason not enrolled]],Table1[[#This Row],[Reason first service not received]])","v":"Don't want to be in research study"}]
[1591,null,"25 to 44 yrs","M","Non-Hispanic/Latino","White","Yes","No","No","Employed","7 to 12","Cardio or Respiratory","Non-work related","Non-workers comp","Industry 3","Occupation 1","Self","Electronic Health Records","County B","Email",1,1,null,1,null,1,null,0,"Circumstances changed",0,null,"2019-09-29","2019-10-12","2019-11-24",null,null,{"$f":"IF(Table1[[#This Row],[First service received]]=1,\"Never dropped\",IF(Table1[[#This Row],[Enrolled]]=1,\"No first service\",IF(Table1[[#This Row],[Expressed interest]]=1,\"Not enrolled\",IF(Table1[[#This Row],[Eligible]]=1,\"Not interested\",IF(Table1[[#This Row],[Contacted]]=1,\"Not eligible\",IF(Table1[[#This Row],[Identified]]=1,\"Not contacted\",\"\"))))))","v":"Not enrolled"},{"$f":"_xlfn.CONCAT(Table1[[#This Row],[Reason not contacted]],Table1[[#This Row],[Reason not eligible]],Table1[[#This Row],[Reason not interested]],Table1[[#This Row],[Reason not enrolled]],Table1[[#This Row],[Reason first service not received]])","v":"Circumstances changed"}]
[1046,null,"25 to 44 yrs","M","Non-Hispanic/Latino","White","Yes","Yes","No","Employed","0 to 1","MSK","Non-work related","Non-workers comp","Industry 3","Occupation 3","Employer","Electronic Health Records","County C","Phone",1,1,null,1,null,1,null,0,"Circumstances changed",0,null,"2019-09-30","2019-10-08","2019-10-08",null,null,{"$f":"IF(Table1[[#This Row],[First service received]]=1,\"Never dropped\",IF(Table1[[#This Row],[Enrolled]]=1,\"No first service\",IF(Table1[[#This Row],[Expressed interest]]=1,\"Not enrolled\",IF(Table1[[#This Row],[Eligible]]=1,\"Not interested\",IF(Table1[[#This Row],[Contacted]]=1,\"Not eligible\",IF(Table1[[#This Row],[Identified]]=1,\"Not contacted\",\"\"))))))","v":"Not enrolled"},{"$f":"_xlfn.CONCAT(Table1[[#This Row],[Reason not contacted]],Table1[[#This Row],[Reason not eligible]],Table1[[#This Row],[Reason not interested]],Table1[[#This Row],[Reason not enrolled]],Table1[[#This Row],[Reason first service not received]])","v":"Circumstances changed"}]
[1090,null,"25 to 44 yrs","M","Non-Hispanic/Latino","Black or African-American","Yes","Yes","No","Employed","7 to 12","Other","Non-work related","Non-workers comp","Industry 1","Occupation 1","Employer","Electronic Health Records","County B","Phone",1,1,null,1,null,1,null,1,null,1,null,"2019-09-30","2019-10-06","2019-10-07","2019-10-26","2019-10-28",{"$f":"IF(Table1[[#This Row],[First service received]]=1,\"Never dropped\",IF(Table1[[#This Row],[Enrolled]]=1,\"No first service\",IF(Table1[[#This Row],[Expressed interest]]=1,\"Not enrolled\",IF(Table1[[#This Row],[Eligible]]=1,\"Not interested\",IF(Table1[[#This Row],[Contacted]]=1,\"Not eligible\",IF(Table1[[#This Row],[Identified]]=1,\"Not contacted\",\"\"))))))","v":"Never dropped"},{"$f":"_xlfn.CONCAT(Table1[[#This Row],[Reason not contacted]],Table1[[#This Row],[Reason not eligible]],Table1[[#This Row],[Reason not interested]],Table1[[#This Row],[Reason not enrolled]],Table1[[#This Row],[Reason first service not received]])","v":""}]
[1185,null,"45 to 64 yrs","F","Non-Hispanic/Latino","White","Yes","Yes","No","Employed","0 to 1","MSK","Non-work related","Non-workers comp","Industry 3","Occupation 3","Health provider","Clinic appointment schedules","County B","Email",1,1,null,0,"Ineligible reason1",0,null,0,null,0,null,"2019-09-30","2019-10-09","2019-10-12",null,null,{"$f":"IF(Table1[[#This Row],[First service received]]=1,\"Never dropped\",IF(Table1[[#This Row],[Enrolled]]=1,\"No first service\",IF(Table1[[#This Row],[Expressed interest]]=1,\"Not enrolled\",IF(Table1[[#This Row],[Eligible]]=1,\"Not interested\",IF(Table1[[#This Row],[Contacted]]=1,\"Not eligible\",IF(Table1[[#This Row],[Identified]]=1,\"Not contacted\",\"\"))))))","v":"Not eligible"},{"$f":"_xlfn.CONCAT(Table1[[#This Row],[Reason not contacted]],Table1[[#This Row],[Reason not eligible]],Table1[[#This Row],[Reason not interested]],Table1[[#This Row],[Reason not enrolled]],Table1[[#This Row],[Reason first service not received]])","v":"Ineligible reason1"}]
[1247,null,"25 to 44 yrs","M","Non-Hispanic/Latino","Black or African-American","Yes","Yes","No","Employed","7 to 12","Other","Non-work related","Non-workers comp","Industry 1","Occupation 1","Employer","Electronic Health Records","County B","Phone",1,1,null,1,null,1,null,1,null,1,null,"2019-09-30","2019-10-06","2019-10-07","2019-10-26","2019-10-28",{"$f":"IF(Table1[[#This Row],[First service received]]=1,\"Never dropped\",IF(Table1[[#This Row],[Enrolled]]=1,\"No first service\",IF(Table1[[#This Row],[Expressed interest]]=1,\"Not enrolled\",IF(Table1[[#This Row],[Eligible]]=1,\"Not interested\",IF(Table1[[#This Row],[Contacted]]=1,\"Not eligible\",IF(Table1[[#This Row],[Identified]]=1,\"Not contacted\",\"\"))))))","v":"Never dropped"},{"$f":"_xlfn.CONCAT(Table1[[#This Row],[Reason not contacted]],Table1[[#This Row],[Reason not eligible]],Table1[[#This Row],[Reason not interested]],Table1[[#This Row],[Reason not enrolled]],Table1[[#This Row],[Reason first service not received]])","v":""}]
[1420,null,"45 to 64 yrs","M","Hispanic/Latino","White","Yes","Yes","No","Employed","7 to 12","Other","Non-work related","Non-workers comp","Industry 3","Occupation 1","Workforce partner","Electronic Health Records","County B","Phone",1,1,null,1,null,0,"Not interested reason3",0,null,0,null,"2019-09-30","2019-10-06","2019-10-22",null,null,{"$f":"IF(Table1[[#This Row],[First service received]]=1,\"Never dropped\",IF(Table1[[#This Row],[Enrolled]]=1,\"No first service\",IF(Table1[[#This Row],[Expressed interest]]=1,\"Not enrolled\",IF(Table1[[#This Row],[Eligible]]=1,\"Not interested\",IF(Table1[[#This Row],[Contacted]]=1,\"Not eligible\",IF(Table1[[#This Row],[Identified]]=1,\"Not contacted\",\"\"))))))","v":"Not interested"},{"$f":"_xlfn.CONCAT(Table1[[#This Row],[Reason not contacted]],Table1[[#This Row],[Reason not eligible]],Table1[[#This Row],[Reason not interested]],Table1[[#This Row],[Reason not enrolled]],Table1[[#This Row],[Reason first service not received]])","v":"Not interested reason3"}]
[1448,null,"25 to 44 yrs","M","Non-Hispanic/Latino","White","Yes","Yes","Yes","Employed","0 to 1","Cardio or Respiratory","Work related","Workers comp","Industry 1","Occupation 3","Self","Electronic Health Records","County A","Phone",1,1,null,1,null,1,null,1,null,1,null,"2019-09-30","2019-10-12","2019-10-20","2019-10-30","2019-11-01",{"$f":"IF(Table1[[#This Row],[First service received]]=1,\"Never dropped\",IF(Table1[[#This Row],[Enrolled]]=1,\"No first service\",IF(Table1[[#This Row],[Expressed interest]]=1,\"Not enrolled\",IF(Table1[[#This Row],[Eligible]]=1,\"Not interested\",IF(Table1[[#This Row],[Contacted]]=1,\"Not eligible\",IF(Table1[[#This Row],[Identified]]=1,\"Not contacted\",\"\"))))))","v":"Never dropped"},{"$f":"_xlfn.CONCAT(Table1[[#This Row],[Reason not contacted]],Table1[[#This Row],[Reason not eligible]],Table1[[#This Row],[Reason not interested]],Table1[[#This Row],[Reason not enrolled]],Table1[[#This Row],[Reason first service not received]])","v":""}]
[1533,null,"45 to 64 yrs","M","Non-Hispanic/Latino","White","No","No","No","Not Employed","0 to 1","MSK","Non-work related","Non-workers comp","Industry 4","Occupation 4","Health provider","Clinic appointment schedules","County B","Email",1,1,null,1,null,0,"Impact on provider relationship",0,null,0,null,"2019-09-30","2019-10-01","2019-10-12",null,null,{"$f":"IF(Table1[[#This Row],[First service received]]=1,\"Never dropped\",IF(Table1[[#This Row],[Enrolled]]=1,\"No first service\",IF(Table1[[#This Row],[Expressed interest]]=1,\"Not enrolled\",IF(Table1[[#This Row],[Eligible]]=1,\"Not interested\",IF(Table1[[#This Row],[Contacted]]=1,\"Not eligible\",IF(Table1[[#This Row],[Identified]]=1,\"Not contacted\",\"\"))))))","v":"Not interested"},{"$f":"_xlfn.CONCAT(Table1[[#This Row],[Reason not contacted]],Table1[[#This Row],[Reason not eligible]],Table1[[#This Row],[Reason not interested]],Table1[[#This Row],[Reason not enrolled]],Table1[[#This Row],[Reason first service not received]])","v":"Impact on provider relationship"}]
[1569,null,"25 to 44 yrs","M","Non-Hispanic/Latino","White","Yes","Yes","Yes","Employed","0 to 1","Cardio or Respiratory","Work related","Workers comp","Industry 1","Occupation 3","Self","Electronic Health Records","County A","Phone",1,1,null,1,null,1,null,1,null,1,null,"2019-09-30","2019-10-12","2019-10-20","2019-10-30","2019-11-01",{"$f":"IF(Table1[[#This Row],[First service received]]=1,\"Never dropped\",IF(Table1[[#This Row],[Enrolled]]=1,\"No first service\",IF(Table1[[#This Row],[Expressed interest]]=1,\"Not enrolled\",IF(Table1[[#This Row],[Eligible]]=1,\"Not interested\",IF(Table1[[#This Row],[Contacted]]=1,\"Not eligible\",IF(Table1[[#This Row],[Identified]]=1,\"Not contacted\",\"\"))))))","v":"Never dropped"},{"$f":"_xlfn.CONCAT(Table1[[#This Row],[Reason not contacted]],Table1[[#This Row],[Reason not eligible]],Table1[[#This Row],[Reason not interested]],Table1[[#This Row],[Reason not enrolled]],Table1[[#This Row],[Reason first service not received]])","v":""}]
[1010,"lorem ipsum","45 to 64 yrs","F","Non-Hispanic/Latino","White","Yes","Yes","No","Employed","2 to 6","Other","Non-work related","Non-workers comp","Industry 1","Occupation 4","Workforce partner","Electronic Health Records","County B","Email",1,1,null,1,null,0,"Not interested reason3",0,null,0,null,"2019-10-01","2019-10-08","2019-11-03",null,null,{"$f":"IF(Table1[[#This Row],[First service received]]=1,\"Never dropped\",IF(Table1[[#This Row],[Enrolled]]=1,\"No first service\",IF(Table1[[#This Row],[Expressed interest]]=1,\"Not enrolled\",IF(Table1[[#This Row],[Eligible]]=1,\"Not interested\",IF(Table1[[#This Row],[Contacted]]=1,\"Not eligible\",IF(Table1[[#This Row],[Identified]]=1,\"Not contacted\",\"\"))))))","v":"Not interested"},{"$f":"_xlfn.CONCAT(Table1[[#This Row],[Reason not contacted]],Table1[[#This Row],[Reason not eligible]],Table1[[#This Row],[Reason not interested]],Table1[[#This Row],[Reason not enrolled]],Table1[[#This Row],[Reason first service not received]])","v":"Not interested reason3"}]
[1280,null,"25 to 44 yrs","F","Non-Hispanic/Latino","Other or 2 or more","Yes","No","No","Not Employed","0 to 1","Cardio or Respiratory","Work related","Workers comp","Industry 4","Occupation 4","Health provider","Clinic appointment schedules","County B","Email",1,1,null,1,null,1,null,0,"Not enrolled reason1",0,null,"2019-10-01","2019-10-16","2019-11-23",null,null,{"$f":"IF(Table1[[#This Row],[First service received]]=1,\"Never dropped\",IF(Table1[[#This Row],[Enrolled]]=1,\"No first service\",IF(Table1[[#This Row],[Expressed interest]]=1,\"Not enrolled\",IF(Table1[[#This Row],[Eligible]]=1,\"Not interested\",IF(Table1[[#This Row],[Contacted]]=1,\"Not eligible\",IF(Table1[[#This Row],[Identified]]=1,\"Not contacted\",\"\"))))))","v":"Not enrolled"},{"$f":"_xlfn.CONCAT(Table1[[#This Row],[Reason not contacted]],Table1[[#This Row],[Reason not eligible]],Table1[[#This Row],[Reason not interested]],Table1[[#This Row],[Reason not enrolled]],Table1[[#This Row],[Reason first service not received]])","v":"Not enrolled reason1"}]
[1392,null,"45 to 64 yrs","F","Non-Hispanic/Latino","American Indian or Alaska Native","Yes","Yes","No","Employed","2 to 6","Cardio or Respiratory","Non-work related","Non-workers comp","Industry 3","Occupation 2","Health provider","Work restriction forms","County B","Phone",1,0,"Contacted, no response",0,null,0,null,0,null,0,null,"2019-10-01",null,null,null,null,{"$f":"IF(Table1[[#This Row],[First service received]]=1,\"Never dropped\",IF(Table1[[#This Row],[Enrolled]]=1,\"No first service\",IF(Table1[[#This Row],[Expressed interest]]=1,\"Not enrolled\",IF(Table1[[#This Row],[Eligible]]=1,\"Not interested\",IF(Table1[[#This Row],[Contacted]]=1,\"Not eligible\",IF(Table1[[#This Row],[Identified]]=1,\"Not contacted\",\"\"))))))","v":"Not contacted"},{"$f":"_xlfn.CONCAT(Table1[[#This Row],[Reason not contacted]],Table1[[#This Row],[Reason not eligible]],Table1[[#This Row],[Reason not interested]],Table1[[#This Row],[Reason not enrolled]],Table1[[#This Row],[Reason first service not received]])","v":"Contacted, no response"}]
[1423,null,"18 to 24 yrs","M","Non-Hispanic/Latino","White","Yes","Yes","No","Employed","13+ weeks","MSK","Non-work related","Non-workers comp","Industry 3","Occupation 3","Health provider","Clinic appointment schedules","County B","Email",1,0,"Contacted, no response",0,null,0,null,0,null,0,null,"2019-10-01",null,null,null,null,{"$f":"IF(Table1[[#This Row],[First service received]]=1,\"Never dropped\",IF(Table1[[#This Row],[Enrolled]]=1,\"No first service\",IF(Table1[[#This Row],[Expressed interest]]=1,\"Not enrolled\",IF(Table1[[#This Row],[Eligible]]=1,\"Not interested\",IF(Table1[[#This Row],[Contacted]]=1,\"Not eligible\",IF(Table1[[#This Row],[Identified]]=1,\"Not contacted\",\"\"))))))","v":"Not contacted"},{"$f":"_xlfn.CONCAT(Table1[[#This Row],[Reason not contacted]],Table1[[#This Row],[Reason not eligible]],Table1[[#This Row],[Reason not interested]],Table1[[#This Row],[Reason not enrolled]],Table1[[#This Row],[Reason first service not received]])","v":"Contacted, no response"}]
[1005,null,"25 to 44 yrs","M","Non-Hispanic/Latino","Black or African-American","No","Yes","No","Employed","2 to 6","MSK","Non-work related","Non-workers comp","Industry 2","Occupation 3","Workforce partner","Electronic Health Records","County A","Phone",1,1,null,1,null,1,null,1,null,1,null,"2019-10-02","2019-10-06","2019-10-17","2019-10-24","2019-10-25",{"$f":"IF(Table1[[#This Row],[First service received]]=1,\"Never dropped\",IF(Table1[[#This Row],[Enrolled]]=1,\"No first service\",IF(Table1[[#This Row],[Expressed interest]]=1,\"Not enrolled\",IF(Table1[[#This Row],[Eligible]]=1,\"Not interested\",IF(Table1[[#This Row],[Contacted]]=1,\"Not eligible\",IF(Table1[[#This Row],[Identified]]=1,\"Not contacted\",\"\"))))))","v":"Never dropped"},{"$f":"_xlfn.CONCAT(Table1[[#This Row],[Reason not contacted]],Table1[[#This Row],[Reason not eligible]],Table1[[#This Row],[Reason not interested]],Table1[[#This Row],[Reason not enrolled]],Table1[[#This Row],[Reason first service not received]])","v":""}]
[1143,null,"45 to 64 yrs","F","Non-Hispanic/Latino","American Indian or Alaska Native","Yes","No","No","Employed","2 to 6","MSK","Non-work related","Non-workers comp","Industry 3","Occupation 2","Health provider","Clinic appointment schedules","County B","Phone",1,1,null,0,"Ineligible reason1",0,null,0,null,0,null,"2019-10-02","2019-10-06","2019-11-11",null,null,{"$f":"IF(Table1[[#This Row],[First service received]]=1,\"Never dropped\",IF(Table1[[#This Row],[Enrolled]]=1,\"No first service\",IF(Table1[[#This Row],[Expressed interest]]=1,\"Not enrolled\",IF(Table1[[#This Row],[Eligible]]=1,\"Not interested\",IF(Table1[[#This Row],[Contacted]]=1,\"Not eligible\",IF(Table1[[#This Row],[Identified]]=1,\"Not contacted\",\"\"))))))","v":"Not eligible"},{"$f":"_xlfn.CONCAT(Table1[[#This Row],[Reason not contacted]],Table1[[#This Row],[Reason not eligible]],Table1[[#This Row],[Reason not interested]],Table1[[#This Row],[Reason not enrolled]],Table1[[#This Row],[Reason first service not received]])","v":"Ineligible reason1"}]
[1289,null,"18 to 24 yrs","F","Non-Hispanic/Latino","Asian","Yes","Yes","No","Employed","7 to 12","MSK","Work related","Non-workers comp","Industry 2","Occupation 3","Health provider","Voc rehab centers","County B","Email",1,1,null,1,null,1,null,1,null,1,null,"2019-10-02","2019-10-17","2019-10-25","2019-11-06","2019-11-13",{"$f":"IF(Table1[[#This Row],[First service received]]=1,\"Never dropped\",IF(Table1[[#This Row],[Enrolled]]=1,\"No first service\",IF(Table1[[#This Row],[Expressed interest]]=1,\"Not enrolled\",IF(Table1[[#This Row],[Eligible]]=1,\"Not interested\",IF(Table1[[#This Row],[Contacted]]=1,\"Not eligible\",IF(Table1[[#This Row],[Identified]]=1,\"Not contacted\",\"\"))))))","v":"Never dropped"},{"$f":"_xlfn.CONCAT(Table1[[#This Row],[Reason not contacted]],Table1[[#This Row],[Reason not eligible]],Table1[[#This Row],[Reason not interested]],Table1[[#This Row],[Reason not enrolled]],Table1[[#This Row],[Reason first service not received]])","v":""}]
[1305,null,"45 to 64 yrs","M","Non-Hispanic/Latino","Black or African-American","Yes","Yes","No","Employed","7 to 12","MSK","Work related","Workers comp","Industry 1","Occupation 3","Health provider","Worker’s comp database","County B","Other",1,0,"Inaccurate contact info",0,null,0,null,0,null,0,null,"2019-10-02",null,null,null,null,{"$f":"IF(Table1[[#This Row],[First service received]]=1,\"Never dropped\",IF(Table1[[#This Row],[Enrolled]]=1,\"No first service\",IF(Table1[[#This Row],[Expressed interest]]=1,\"Not enrolled\",IF(Table1[[#This Row],[Eligible]]=1,\"Not interested\",IF(Table1[[#This Row],[Contacted]]=1,\"Not eligible\",IF(Table1[[#This Row],[Identified]]=1,\"Not contacted\",\"\"))))))","v":"Not contacted"},{"$f":"_xlfn.CONCAT(Table1[[#This Row],[Reason not contacted]],Table1[[#This Row],[Reason not eligible]],Table1[[#This Row],[Reason not interested]],Table1[[#This Row],[Reason not enrolled]],Table1[[#This Row],[Reason first service not received]])","v":"Inaccurate contact info"}]
[1437,null,"25 to 44 yrs","M","Non-Hispanic/Latino","White","Yes","Yes","No","Not Employed","0 to 1","MSK","Non-work related","Non-workers comp","Industry 3","Occupation 2","Health provider","FMLA forms","County A","Email",1,1,null,1,null,0,"Impact on provider relationship",0,null,0,null,"2019-10-02","2019-10-07","2019-10-18",null,null,{"$f":"IF(Table1[[#This Row],[First service received]]=1,\"Never dropped\",IF(Table1[[#This Row],[Enrolled]]=1,\"No first service\",IF(Table1[[#This Row],[Expressed interest]]=1,\"Not enrolled\",IF(Table1[[#This Row],[Eligible]]=1,\"Not interested\",IF(Table1[[#This Row],[Contacted]]=1,\"Not eligible\",IF(Table1[[#This Row],[Identified]]=1,\"Not contacted\",\"\"))))))","v":"Not interested"},{"$f":"_xlfn.CONCAT(Table1[[#This Row],[Reason not contacted]],Table1[[#This Row],[Reason not eligible]],Table1[[#This Row],[Reason not interested]],Table1[[#This Row],[Reason not enrolled]],Table1[[#This Row],[Reason first service not received]])","v":"Impact on provider relationship"}]
[1127,null,"25 to 44 yrs","F","Non-Hispanic/Latino","White","Yes","Yes","No","Employed","2 to 6","MSK","Work related","Non-workers comp","Industry 1","Occupation 3","Health provider","Clinic appointment schedules","County B","Other",1,0,"No contact info",0,null,0,null,0,null,0,null,"2019-10-03",null,null,null,null,{"$f":"IF(Table1[[#This Row],[First service received]]=1,\"Never dropped\",IF(Table1[[#This Row],[Enrolled]]=1,\"No first service\",IF(Table1[[#This Row],[Expressed interest]]=1,\"Not enrolled\",IF(Table1[[#This Row],[Eligible]]=1,\"Not interested\",IF(Table1[[#This Row],[Contacted]]=1,\"Not eligible\",IF(Table1[[#This Row],[Identified]]=1,\"Not contacted\",\"\"))))))","v":"Not contacted"},{"$f":"_xlfn.CONCAT(Table1[[#This Row],[Reason not contacted]],Table1[[#This Row],[Reason not eligible]],Table1[[#This Row],[Reason not interested]],Table1[[#This Row],[Reason not enrolled]],Table1[[#This Row],[Reason first service not received]])","v":"No contact info"}]
[1360,null,"25 to 44 yrs","F","Non-Hispanic/Latino","White","Yes","Yes","No","Employed","7 to 12","Cardio or Respiratory","Non-work related","Non-workers comp","Industry 1","Occupation 1","Health provider","Work restriction forms","County B","Phone",1,1,null,1,null,0,"Not interested reason3",0,null,0,null,"2019-10-03","2019-10-05","2019-11-09",null,null,{"$f":"IF(Table1[[#This Row],[First service received]]=1,\"Never dropped\",IF(Table1[[#This Row],[Enrolled]]=1,\"No first service\",IF(Table1[[#This Row],[Expressed interest]]=1,\"Not enrolled\",IF(Table1[[#This Row],[Eligible]]=1,\"Not interested\",IF(Table1[[#This Row],[Contacted]]=1,\"Not eligible\",IF(Table1[[#This Row],[Identified]]=1,\"Not contacted\",\"\"))))))","v":"Not interested"},{"$f":"_xlfn.CONCAT(Table1[[#This Row],[Reason not contacted]],Table1[[#This Row],[Reason not eligible]],Table1[[#This Row],[Reason not interested]],Table1[[#This Row],[Reason not enrolled]],Table1[[#This Row],[Reason first service not received]])","v":"Not interested reason3"}]
[1515,null,"45 to 64 yrs","F","Hispanic/Latino","White","No","Yes","No","Not Employed","0 to 1","MSK","Non-work related","Non-workers comp","Industry 1","Occupation 3","Workforce partner","Electronic Health Records","County B","Phone",1,1,null,1,null,0,"Impact on provider relationship",0,null,0,null,"2019-10-03","2019-10-13","2019-10-31",null,null,{"$f":"IF(Table1[[#This Row],[First service received]]=1,\"Never dropped\",IF(Table1[[#This Row],[Enrolled]]=1,\"No first service\",IF(Table1[[#This Row],[Expressed interest]]=1,\"Not enrolled\",IF(Table1[[#This Row],[Eligible]]=1,\"Not interested\",IF(Table1[[#This Row],[Contacted]]=1,\"Not eligible\",IF(Table1[[#This Row],[Identified]]=1,\"Not contacted\",\"\"))))))","v":"Not interested"},{"$f":"_xlfn.CONCAT(Table1[[#This Row],[Reason not contacted]],Table1[[#This Row],[Reason not eligible]],Table1[[#This Row],[Reason not interested]],Table1[[#This Row],[Reason not enrolled]],Table1[[#This Row],[Reason first service not received]])","v":"Impact on provider relationship"}]
[1549,null,"45 to 64 yrs","F","Non-Hispanic/Latino","White","Yes","Yes","No","Employed","2 to 6","Cardio or Respiratory","Non-work related","Non-workers comp","Industry 3","Occupation 4","Self","Electronic Health Records","County C","Phone",1,1,null,1,null,1,null,1,null,0,"No show","2019-10-03","2019-10-08","2019-10-16","2019-10-24",null,{"$f":"IF(Table1[[#This Row],[First service received]]=1,\"Never dropped\",IF(Table1[[#This Row],[Enrolled]]=1,\"No first service\",IF(Table1[[#This Row],[Expressed interest]]=1,\"Not enrolled\",IF(Table1[[#This Row],[Eligible]]=1,\"Not interested\",IF(Table1[[#This Row],[Contacted]]=1,\"Not eligible\",IF(Table1[[#This Row],[Identified]]=1,\"Not contacted\",\"\"))))))","v":"No first service"},{"$f":"_xlfn.CONCAT(Table1[[#This Row],[Reason not contacted]],Table1[[#This Row],[Reason not eligible]],Table1[[#This Row],[Reason not interested]],Table1[[#This Row],[Reason not enrolled]],Table1[[#This Row],[Reason first service not received]])","v":"No show"}]
[1575,null,"25 to 44 yrs","M","Non-Hispanic/Latino","Black or African-American","No","Yes","No","Employed","2 to 6","MSK","Non-work related","Non-workers comp","Industry 2","Occupation 3","Health provider","Work restriction forms","County B","In person",1,1,null,1,null,1,null,0,"Circumstances changed",0,null,"2019-10-03","2019-10-04","2019-10-25",null,null,{"$f":"IF(Table1[[#This Row],[First service received]]=1,\"Never dropped\",IF(Table1[[#This Row],[Enrolled]]=1,\"No first service\",IF(Table1[[#This Row],[Expressed interest]]=1,\"Not enrolled\",IF(Table1[[#This Row],[Eligible]]=1,\"Not interested\",IF(Table1[[#This Row],[Contacted]]=1,\"Not eligible\",IF(Table1[[#This Row],[Identified]]=1,\"Not contacted\",\"\"))))))","v":"Not enrolled"},{"$f":"_xlfn.CONCAT(Table1[[#This Row],[Reason not contacted]],Table1[[#This Row],[Reason not eligible]],Table1[[#This Row],[Reason not interested]],Table1[[#This Row],[Reason not enrolled]],Table1[[#This Row],[Reason first service not received]])","v":"Circumstances changed"}]
[1162,null,"25 to 44 yrs","M","Hispanic/Latino","White","Yes","Yes","No","Employed","2 to 6","MSK","Work related","Workers comp","Industry 2","Occupation 1","Self","Electronic Health Records","County B","Email",1,1,null,0,"Ineligible reason3",0,null,0,null,0,null,"2019-10-04","2019-10-17","2019-11-14",null,null,{"$f":"IF(Table1[[#This Row],[First service received]]=1,\"Never dropped\",IF(Table1[[#This Row],[Enrolled]]=1,\"No first service\",IF(Table1[[#This Row],[Expressed interest]]=1,\"Not enrolled\",IF(Table1[[#This Row],[Eligible]]=1,\"Not interested\",IF(Table1[[#This Row],[Contacted]]=1,\"Not eligible\",IF(Table1[[#This Row],[Identified]]=1,\"Not contacted\",\"\"))))))","v":"Not eligible"},{"$f":"_xlfn.CONCAT(Table1[[#This Row],[Reason not contacted]],Table1[[#This Row],[Reason not eligible]],Table1[[#This Row],[Reason not interested]],Table1[[#This Row],[Reason not enrolled]],Table1[[#This Row],[Reason first service not received]])","v":"Ineligible reason3"}]
[1343,null,"25 to 44 yrs","F","Non-Hispanic/Latino","White","Yes","Yes","No","Employed","0 to 1","Cardio or Respiratory","Non-work related","Non-workers comp","Industry 2","Occupation 1","Workforce partner","Electronic Health Records","County C","Phone",1,1,null,1,null,1,null,0,"Circumstances changed",0,null,"2019-10-04","2019-10-09","2019-11-23",null,null,{"$f":"IF(Table1[[#This Row],[First service received]]=1,\"Never dropped\",IF(Table1[[#This Row],[Enrolled]]=1,\"No first service\",IF(Table1[[#This Row],[Expressed interest]]=1,\"Not enrolled\",IF(Table1[[#This Row],[Eligible]]=1,\"Not interested\",IF(Table1[[#This Row],[Contacted]]=1,\"Not eligible\",IF(Table1[[#This Row],[Identified]]=1,\"Not contacted\",\"\"))))))","v":"Not enrolled"},{"$f":"_xlfn.CONCAT(Table1[[#This Row],[Reason not contacted]],Table1[[#This Row],[Reason not eligible]],Table1[[#This Row],[Reason not interested]],Table1[[#This Row],[Reason not enrolled]],Table1[[#This Row],[Reason first service not received]])","v":"Circumstances changed"}]
[1455,null,"25 to 44 yrs","F","Non-Hispanic/Latino","Black or African-American","Yes","Yes","Yes","Employed","2 to 6","Cardio or Respiratory","Non-work related","Non-workers comp","Industry 1","Occupation 1","Self","Electronic Health Records","County A","Phone",1,1,null,1,null,1,null,1,null,1,null,"2019-10-04","2019-10-06","2019-10-11","2019-10-21","2019-10-29",{"$f":"IF(Table1[[#This Row],[First service received]]=1,\"Never dropped\",IF(Table1[[#This Row],[Enrolled]]=1,\"No first service\",IF(Table1[[#This Row],[Expressed interest]]=1,\"Not enrolled\",IF(Table1[[#This Row],[Eligible]]=1,\"Not interested\",IF(Table1[[#This Row],[Contacted]]=1,\"Not eligible\",IF(Table1[[#This Row],[Identified]]=1,\"Not contacted\",\"\"))))))","v":"Never dropped"},{"$f":"_xlfn.CONCAT(Table1[[#This Row],[Reason not contacted]],Table1[[#This Row],[Reason not eligible]],Table1[[#This Row],[Reason not interested]],Table1[[#This Row],[Reason not enrolled]],Table1[[#This Row],[Reason first service not received]])","v":""}]
[1532,null,"18 to 24 yrs","F","Hispanic/Latino","White","Yes","Yes","No","Not Employed","0 to 1","Other","Non-work related","Non-workers comp","Industry 3","Occupation 2","Health provider","Worker’s comp database","County B","Email",1,1,null,1,null,1,null,1,null,1,null,"2019-10-04","2019-10-17","2019-10-17","2019-11-02","2019-11-05",{"$f":"IF(Table1[[#This Row],[First service received]]=1,\"Never dropped\",IF(Table1[[#This Row],[Enrolled]]=1,\"No first service\",IF(Table1[[#This Row],[Expressed interest]]=1,\"Not enrolled\",IF(Table1[[#This Row],[Eligible]]=1,\"Not interested\",IF(Table1[[#This Row],[Contacted]]=1,\"Not eligible\",IF(Table1[[#This Row],[Identified]]=1,\"Not contacted\",\"\"))))))","v":"Never dropped"},{"$f":"_xlfn.CONCAT(Table1[[#This Row],[Reason not contacted]],Table1[[#This Row],[Reason not eligible]],Table1[[#This Row],[Reason not interested]],Table1[[#This Row],[Reason not enrolled]],Table1[[#This Row],[Reason first service not received]])","v":""}]
[1547,null,"45 to 64 yrs","F","Non-Hispanic/Latino","Black or African-American","Yes","Yes","No","Not Employed","0 to 1","Other","Work related","Workers comp","Industry 3","Occupation 4","Self","Electronic Health Records","County C","Email",1,1,null,1,null,0,"Don't want to be in research study",0,null,0,null,"2019-10-04","2019-10-16","2019-10-21",null,null,{"$f":"IF(Table1[[#This Row],[First service received]]=1,\"Never dropped\",IF(Table1[[#This Row],[Enrolled]]=1,\"No first service\",IF(Table1[[#This Row],[Expressed interest]]=1,\"Not enrolled\",IF(Table1[[#This Row],[Eligible]]=1,\"Not interested\",IF(Table1[[#This Row],[Contacted]]=1,\"Not eligible\",IF(Table1[[#This Row],[Identified]]=1,\"Not contacted\",\"\"))))))","v":"Not interested"},{"$f":"_xlfn.CONCAT(Table1[[#This Row],[Reason not contacted]],Table1[[#This Row],[Reason not eligible]],Table1[[#This Row],[Reason not interested]],Table1[[#This Row],[Reason not enrolled]],Table1[[#This Row],[Reason first service not received]])","v":"Don't want to be in research study"}]
[1465,null,"25 to 44 yrs","F","Non-Hispanic/Latino","White","Yes","Yes","No","Employed","2 to 6","Other","Non-work related","Non-workers comp","Industry 4","Occupation 3","Health provider","FMLA forms","County B","In person",1,1,null,1,null,1,null,0,"Circumstances changed",0,null,"2019-10-05","2019-10-11","2019-11-03",null,null,{"$f":"IF(Table1[[#This Row],[First service received]]=1,\"Never dropped\",IF(Table1[[#This Row],[Enrolled]]=1,\"No first service\",IF(Table1[[#This Row],[Expressed interest]]=1,\"Not enrolled\",IF(Table1[[#This Row],[Eligible]]=1,\"Not interested\",IF(Table1[[#This Row],[Contacted]]=1,\"Not eligible\",IF(Table1[[#This Row],[Identified]]=1,\"Not contacted\",\"\"))))))","v":"Not enrolled"},{"$f":"_xlfn.CONCAT(Table1[[#This Row],[Reason not contacted]],Table1[[#This Row],[Reason not eligible]],Table1[[#This Row],[Reason not interested]],Table1[[#This Row],[Reason not enrolled]],Table1[[#This Row],[Reason first service not received]])","v":"Circumstances changed"}]
[1050,null,"25 to 44 yrs","F","Hispanic/Latino","White","Yes","Yes","No","Self-employed","13+ weeks","Other","Non-work related","Non-workers comp","Industry 3","Occupation 2","Health provider","Voc rehab centers","County B","Other",1,0,"Inaccurate contact info",0,null,0,null,0,null,0,null,"2019-10-06",null,null,null,null,{"$f":"IF(Table1[[#This Row],[First service received]]=1,\"Never dropped\",IF(Table1[[#This Row],[Enrolled]]=1,\"No first service\",IF(Table1[[#This Row],[Expressed interest]]=1,\"Not enrolled\",IF(Table1[[#This Row],[Eligible]]=1,\"Not interested\",IF(Table1[[#This Row],[Contacted]]=1,\"Not eligible\",IF(Table1[[#This Row],[Identified]]=1,\"Not contacted\",\"\"))))))","v":"Not contacted"},{"$f":"_xlfn.CONCAT(Table1[[#This Row],[Reason not contacted]],Table1[[#This Row],[Reason not eligible]],Table1[[#This Row],[Reason not interested]],Table1[[#This Row],[Reason not enrolled]],Table1[[#This Row],[Reason first service not received]])","v":"Inaccurate contact info"}]
[1348,null,"18 to 24 yrs","F","Non-Hispanic/Latino","Asian","Yes","Yes","No","Employed","7 to 12","MSK","Work related","Non-workers comp","Industry 2","Occupation 3","Health provider","Voc rehab centers","County B","Phone",1,1,null,1,null,1,null,1,null,1,null,"2019-10-06","2019-10-08","2019-10-12","2019-11-06","2019-11-20",{"$f":"IF(Table1[[#This Row],[First service received]]=1,\"Never dropped\",IF(Table1[[#This Row],[Enrolled]]=1,\"No first service\",IF(Table1[[#This Row],[Expressed interest]]=1,\"Not enrolled\",IF(Table1[[#This Row],[Eligible]]=1,\"Not interested\",IF(Table1[[#This Row],[Contacted]]=1,\"Not eligible\",IF(Table1[[#This Row],[Identified]]=1,\"Not contacted\",\"\"))))))","v":"Never dropped"},{"$f":"_xlfn.CONCAT(Table1[[#This Row],[Reason not contacted]],Table1[[#This Row],[Reason not eligible]],Table1[[#This Row],[Reason not interested]],Table1[[#This Row],[Reason not enrolled]],Table1[[#This Row],[Reason first service not received]])","v":""}]
[1351,null,"25 to 44 yrs","M","Hispanic/Latino","White","Yes","Yes","No","Employed","7 to 12","MSK","Non-work related","Non-workers comp","Industry 3","Occupation 2","Workforce partner","Electronic Health Records","County B","Phone",1,1,null,1,null,1,null,1,null,1,null,"2019-10-06","2019-10-20","2019-10-28","2019-11-07","2019-11-18",{"$f":"IF(Table1[[#This Row],[First service received]]=1,\"Never dropped\",IF(Table1[[#This Row],[Enrolled]]=1,\"No first service\",IF(Table1[[#This Row],[Expressed interest]]=1,\"Not enrolled\",IF(Table1[[#This Row],[Eligible]]=1,\"Not interested\",IF(Table1[[#This Row],[Contacted]]=1,\"Not eligible\",IF(Table1[[#This Row],[Identified]]=1,\"Not contacted\",\"\"))))))","v":"Never dropped"},{"$f":"_xlfn.CONCAT(Table1[[#This Row],[Reason not contacted]],Table1[[#This Row],[Reason not eligible]],Table1[[#This Row],[Reason not interested]],Table1[[#This Row],[Reason not enrolled]],Table1[[#This Row],[Reason first service not received]])","v":""}]
[1477,null,"25 to 44 yrs","M","Non-Hispanic/Latino","Black or African-American","Yes","Yes","No","Not Employed","0 to 1","MSK","Non-work related","Non-workers comp","Industry 3","Occupation 3","Employer","Electronic Health Records","County B","Phone",1,1,null,1,null,1,null,1,null,1,null,"2019-10-06","2019-10-20","2019-10-23","2019-11-11","2019-11-14",{"$f":"IF(Table1[[#This Row],[First service received]]=1,\"Never dropped\",IF(Table1[[#This Row],[Enrolled]]=1,\"No first service\",IF(Table1[[#This Row],[Expressed interest]]=1,\"Not enrolled\",IF(Table1[[#This Row],[Eligible]]=1,\"Not interested\",IF(Table1[[#This Row],[Contacted]]=1,\"Not eligible\",IF(Table1[[#This Row],[Identified]]=1,\"Not contacted\",\"\"))))))","v":"Never dropped"},{"$f":"_xlfn.CONCAT(Table1[[#This Row],[Reason not contacted]],Table1[[#This Row],[Reason not eligible]],Table1[[#This Row],[Reason not interested]],Table1[[#This Row],[Reason not enrolled]],Table1[[#This Row],[Reason first service not received]])","v":""}]
[1521,null,"25 to 44 yrs","M","Non-Hispanic/Latino","Black or African-American","Yes","Yes","No","Employed","7 to 12","Other","Work related","Workers comp","Industry 1","Occupation 3","Self","Electronic Health Records","County B","Phone",1,1,null,1,null,0,"Don't want to be in research study",0,null,0,null,"2019-10-06","2019-10-16","2019-11-28",null,null,{"$f":"IF(Table1[[#This Row],[First service received]]=1,\"Never dropped\",IF(Table1[[#This Row],[Enrolled]]=1,\"No first service\",IF(Table1[[#This Row],[Expressed interest]]=1,\"Not enrolled\",IF(Table1[[#This Row],[Eligible]]=1,\"Not interested\",IF(Table1[[#This Row],[Contacted]]=1,\"Not eligible\",IF(Table1[[#This Row],[Identified]]=1,\"Not contacted\",\"\"))))))","v":"Not interested"},{"$f":"_xlfn.CONCAT(Table1[[#This Row],[Reason not contacted]],Table1[[#This Row],[Reason not eligible]],Table1[[#This Row],[Reason not interested]],Table1[[#This Row],[Reason not enrolled]],Table1[[#This Row],[Reason first service not received]])","v":"Don't want to be in research study"}]
[1115,null,"25 to 44 yrs","M","Non-Hispanic/Latino","Black or African-American","Yes","Yes","No","Employed","2 to 6","MSK","Non-work related","Non-workers comp","Industry 4","Occupation 3","Health provider","Clinic appointment schedules","County B","Phone",1,1,null,1,null,1,null,1,null,1,null,"2019-10-07","2019-10-18","2019-10-29","2019-11-17","2019-12-01",{"$f":"IF(Table1[[#This Row],[First service received]]=1,\"Never dropped\",IF(Table1[[#This Row],[Enrolled]]=1,\"No first service\",IF(Table1[[#This Row],[Expressed interest]]=1,\"Not enrolled\",IF(Table1[[#This Row],[Eligible]]=1,\"Not interested\",IF(Table1[[#This Row],[Contacted]]=1,\"Not eligible\",IF(Table1[[#This Row],[Identified]]=1,\"Not contacted\",\"\"))))))","v":"Never dropped"},{"$f":"_xlfn.CONCAT(Table1[[#This Row],[Reason not contacted]],Table1[[#This Row],[Reason not eligible]],Table1[[#This Row],[Reason not interested]],Table1[[#This Row],[Reason not enrolled]],Table1[[#This Row],[Reason first service not received]])","v":""}]
[1225,null,"25 to 44 yrs","F","Non-Hispanic/Latino","American Indian or Alaska Native","Yes","Yes","No","Employed","7 to 12","MSK","Non-work related","Non-workers comp","Industry 3","Occupation 2","Health provider","Worker’s comp database","County B","Phone",1,1,null,1,null,0,"Not interested reason3",0,null,0,null,"2019-10-07","2019-10-18","2019-10-18",null,null,{"$f":"IF(Table1[[#This Row],[First service received]]=1,\"Never dropped\",IF(Table1[[#This Row],[Enrolled]]=1,\"No first service\",IF(Table1[[#This Row],[Expressed interest]]=1,\"Not enrolled\",IF(Table1[[#This Row],[Eligible]]=1,\"Not interested\",IF(Table1[[#This Row],[Contacted]]=1,\"Not eligible\",IF(Table1[[#This Row],[Identified]]=1,\"Not contacted\",\"\"))))))","v":"Not interested"},{"$f":"_xlfn.CONCAT(Table1[[#This Row],[Reason not contacted]],Table1[[#This Row],[Reason not eligible]],Table1[[#This Row],[Reason not interested]],Table1[[#This Row],[Reason not enrolled]],Table1[[#This Row],[Reason first service not received]])","v":"Not interested reason3"}]
[1336,null,"25 to 44 yrs","M","Non-Hispanic/Latino","White","Yes","Yes","No","Employed","2 to 6","MSK","Non-work related","Non-workers comp","Industry 3","Occupation 2","Health provider","Worker’s comp database","County A","Phone",1,1,null,1,null,0,"Impact on provider relationship",0,null,0,null,"2019-10-07","2019-10-15","2019-11-28",null,null,{"$f":"IF(Table1[[#This Row],[First service received]]=1,\"Never dropped\",IF(Table1[[#This Row],[Enrolled]]=1,\"No first service\",IF(Table1[[#This Row],[Expressed interest]]=1,\"Not enrolled\",IF(Table1[[#This Row],[Eligible]]=1,\"Not interested\",IF(Table1[[#This Row],[Contacted]]=1,\"Not eligible\",IF(Table1[[#This Row],[Identified]]=1,\"Not contacted\",\"\"))))))","v":"Not interested"},{"$f":"_xlfn.CONCAT(Table1[[#This Row],[Reason not contacted]],Table1[[#This Row],[Reason not eligible]],Table1[[#This Row],[Reason not interested]],Table1[[#This Row],[Reason not enrolled]],Table1[[#This Row],[Reason first service not received]])","v":"Impact on provider relationship"}]
[1432,null,"25 to 44 yrs","F","Hispanic/Latino","White","Yes","Yes","No","Employed","0 to 1","MSK","Work related","Non-workers comp","Industry 1","Occupation 1","Health provider","FMLA forms","County B","Phone",1,1,null,1,null,1,null,1,null,1,null,"2019-10-07","2019-10-22","2019-10-25","2019-11-10","2019-11-24",{"$f":"IF(Table1[[#This Row],[First service received]]=1,\"Never dropped\",IF(Table1[[#This Row],[Enrolled]]=1,\"No first service\",IF(Table1[[#This Row],[Expressed interest]]=1,\"Not enrolled\",IF(Table1[[#This Row],[Eligible]]=1,\"Not interested\",IF(Table1[[#This Row],[Contacted]]=1,\"Not eligible\",IF(Table1[[#This Row],[Identified]]=1,\"Not contacted\",\"\"))))))","v":"Never dropped"},{"$f":"_xlfn.CONCAT(Table1[[#This Row],[Reason not contacted]],Table1[[#This Row],[Reason not eligible]],Table1[[#This Row],[Reason not interested]],Table1[[#This Row],[Reason not enrolled]],Table1[[#This Row],[Reason first service not received]])","v":""}]
[1556,null,"25 to 44 yrs","F","Non-Hispanic/Latino","Black or African-American","Yes","Yes","No","Employed","7 to 12","MSK","Non-work related","Non-workers comp","Industry 2","Occupation 3","Workforce partner","Electronic Health Records","County B","Phone",1,1,null,0,"Ineligible reason3",0,null,0,null,0,null,"2019-10-07","2019-10-11","2019-11-18",null,null,{"$f":"IF(Table1[[#This Row],[First service received]]=1,\"Never dropped\",IF(Table1[[#This Row],[Enrolled]]=1,\"No first service\",IF(Table1[[#This Row],[Expressed interest]]=1,\"Not enrolled\",IF(Table1[[#This Row],[Eligible]]=1,\"Not interested\",IF(Table1[[#This Row],[Contacted]]=1,\"Not eligible\",IF(Table1[[#This Row],[Identified]]=1,\"Not contacted\",\"\"))))))","v":"Not eligible"},{"$f":"_xlfn.CONCAT(Table1[[#This Row],[Reason not contacted]],Table1[[#This Row],[Reason not eligible]],Table1[[#This Row],[Reason not interested]],Table1[[#This Row],[Reason not enrolled]],Table1[[#This Row],[Reason first service not received]])","v":"Ineligible reason3"}]
[1263,null,"25 to 44 yrs","F","Non-Hispanic/Latino","White","Yes","Yes","No","Employed","7 to 12","MSK","Non-work related","Non-workers comp","Industry 3","Occupation 2","Health provider","Worker’s comp database","County A","In person",1,1,null,1,null,1,null,0,"Not enrolled reason1",0,null,"2019-10-08","2019-10-13","2019-10-15",null,null,{"$f":"IF(Table1[[#This Row],[First service received]]=1,\"Never dropped\",IF(Table1[[#This Row],[Enrolled]]=1,\"No first service\",IF(Table1[[#This Row],[Expressed interest]]=1,\"Not enrolled\",IF(Table1[[#This Row],[Eligible]]=1,\"Not interested\",IF(Table1[[#This Row],[Contacted]]=1,\"Not eligible\",IF(Table1[[#This Row],[Identified]]=1,\"Not contacted\",\"\"))))))","v":"Not enrolled"},{"$f":"_xlfn.CONCAT(Table1[[#This Row],[Reason not contacted]],Table1[[#This Row],[Reason not eligible]],Table1[[#This Row],[Reason not interested]],Table1[[#This Row],[Reason not enrolled]],Table1[[#This Row],[Reason first service not received]])","v":"Not enrolled reason1"}]
[1315,null,"45 to 64 yrs","F","Non-Hispanic/Latino","White","Yes","No","No","Employed","7 to 12","MSK","Work related","Non-workers comp","Industry 4","Occupation 4","Health provider","Voc rehab centers","County B","Phone",1,1,null,1,null,0,"Don't want to be in research study",0,null,0,null,"2019-10-08","2019-10-09","2019-10-17",null,null,{"$f":"IF(Table1[[#This Row],[First service received]]=1,\"Never dropped\",IF(Table1[[#This Row],[Enrolled]]=1,\"No first service\",IF(Table1[[#This Row],[Expressed interest]]=1,\"Not enrolled\",IF(Table1[[#This Row],[Eligible]]=1,\"Not interested\",IF(Table1[[#This Row],[Contacted]]=1,\"Not eligible\",IF(Table1[[#This Row],[Identified]]=1,\"Not contacted\",\"\"))))))","v":"Not interested"},{"$f":"_xlfn.CONCAT(Table1[[#This Row],[Reason not contacted]],Table1[[#This Row],[Reason not eligible]],Table1[[#This Row],[Reason not interested]],Table1[[#This Row],[Reason not enrolled]],Table1[[#This Row],[Reason first service not received]])","v":"Don't want to be in research study"}]
[1342,null,"45 to 64 yrs","F","Hispanic/Latino","White","No","Yes","No","Not Employed","0 to 1","MSK","Non-work related","Non-workers comp","Industry 4","Occupation 3","Workforce partner","Electronic Health Records","County B","Phone",1,1,null,0,"Ineligible reason3",0,null,0,null,0,null,"2019-10-08","2019-10-12","2019-11-19",null,null,{"$f":"IF(Table1[[#This Row],[First service received]]=1,\"Never dropped\",IF(Table1[[#This Row],[Enrolled]]=1,\"No first service\",IF(Table1[[#This Row],[Expressed interest]]=1,\"Not enrolled\",IF(Table1[[#This Row],[Eligible]]=1,\"Not interested\",IF(Table1[[#This Row],[Contacted]]=1,\"Not eligible\",IF(Table1[[#This Row],[Identified]]=1,\"Not contacted\",\"\"))))))","v":"Not eligible"},{"$f":"_xlfn.CONCAT(Table1[[#This Row],[Reason not contacted]],Table1[[#This Row],[Reason not eligible]],Table1[[#This Row],[Reason not interested]],Table1[[#This Row],[Reason not enrolled]],Table1[[#This Row],[Reason first service not received]])","v":"Ineligible reason3"}]
[1413,null,"45 to 64 yrs","M","Non-Hispanic/Latino","White","Yes","Yes","No","Employed","2 to 6","MSK","Work related","Non-workers comp","Industry 1","Occupation 1","Health provider","Worker’s comp database","County B","Phone",1,0,"Contacted, no response",0,null,0,null,0,null,0,null,"2019-10-08",null,null,null,null,{"$f":"IF(Table1[[#This Row],[First service received]]=1,\"Never dropped\",IF(Table1[[#This Row],[Enrolled]]=1,\"No first service\",IF(Table1[[#This Row],[Expressed interest]]=1,\"Not enrolled\",IF(Table1[[#This Row],[Eligible]]=1,\"Not interested\",IF(Table1[[#This Row],[Contacted]]=1,\"Not eligible\",IF(Table1[[#This Row],[Identified]]=1,\"Not contacted\",\"\"))))))","v":"Not contacted"},{"$f":"_xlfn.CONCAT(Table1[[#This Row],[Reason not contacted]],Table1[[#This Row],[Reason not eligible]],Table1[[#This Row],[Reason not interested]],Table1[[#This Row],[Reason not enrolled]],Table1[[#This Row],[Reason first service not received]])","v":"Contacted, no response"}]
[1498,null,"25 to 44 yrs","F","Non-Hispanic/Latino","White","Yes","Yes","No","Employed","2 to 6","MSK","Work related","Workers comp","Industry 3","Occupation 1","Health provider","Voc rehab centers","County A","In person",1,1,null,0,"Ineligible reason1",0,null,0,null,0,null,"2019-10-08","2019-10-15","2019-11-22",null,null,{"$f":"IF(Table1[[#This Row],[First service received]]=1,\"Never dropped\",IF(Table1[[#This Row],[Enrolled]]=1,\"No first service\",IF(Table1[[#This Row],[Expressed interest]]=1,\"Not enrolled\",IF(Table1[[#This Row],[Eligible]]=1,\"Not interested\",IF(Table1[[#This Row],[Contacted]]=1,\"Not eligible\",IF(Table1[[#This Row],[Identified]]=1,\"Not contacted\",\"\"))))))","v":"Not eligible"},{"$f":"_xlfn.CONCAT(Table1[[#This Row],[Reason not contacted]],Table1[[#This Row],[Reason not eligible]],Table1[[#This Row],[Reason not interested]],Table1[[#This Row],[Reason not enrolled]],Table1[[#This Row],[Reason first service not received]])","v":"Ineligible reason1"}]
[1564,null,"45 to 64 yrs","F","Non-Hispanic/Latino","White","Yes","Yes","No","Employed","7 to 12","Other","Non-work related","Non-workers comp","Industry 1","Occupation 3","Health provider","Voc rehab centers","County B","Phone",1,1,null,0,"Ineligible reason1",0,null,0,null,0,null,"2019-10-08","2019-10-12","2019-10-14",null,null,{"$f":"IF(Table1[[#This Row],[First service received]]=1,\"Never dropped\",IF(Table1[[#This Row],[Enrolled]]=1,\"No first service\",IF(Table1[[#This Row],[Expressed interest]]=1,\"Not enrolled\",IF(Table1[[#This Row],[Eligible]]=1,\"Not interested\",IF(Table1[[#This Row],[Contacted]]=1,\"Not eligible\",IF(Table1[[#This Row],[Identified]]=1,\"Not contacted\",\"\"))))))","v":"Not eligible"},{"$f":"_xlfn.CONCAT(Table1[[#This Row],[Reason not contacted]],Table1[[#This Row],[Reason not eligible]],Table1[[#This Row],[Reason not interested]],Table1[[#This Row],[Reason not enrolled]],Table1[[#This Row],[Reason first service not received]])","v":"Ineligible reason1"}]
[1237,null,"25 to 44 yrs","M","Hispanic/Latino","White","Yes","Yes","No","Employed","7 to 12","MSK","Non-work related","Non-workers comp","Industry 1","Occupation 3","Employer","Electronic Health Records","County B","Phone",1,1,null,0,"Ineligible reason1",0,null,0,null,0,null,"2019-10-09","2019-10-23","2019-12-06",null,null,{"$f":"IF(Table1[[#This Row],[First service received]]=1,\"Never dropped\",IF(Table1[[#This Row],[Enrolled]]=1,\"No first service\",IF(Table1[[#This Row],[Expressed interest]]=1,\"Not enrolled\",IF(Table1[[#This Row],[Eligible]]=1,\"Not interested\",IF(Table1[[#This Row],[Contacted]]=1,\"Not eligible\",IF(Table1[[#This Row],[Identified]]=1,\"Not contacted\",\"\"))))))","v":"Not eligible"},{"$f":"_xlfn.CONCAT(Table1[[#This Row],[Reason not contacted]],Table1[[#This Row],[Reason not eligible]],Table1[[#This Row],[Reason not interested]],Table1[[#This Row],[Reason not enrolled]],Table1[[#This Row],[Reason first service not received]])","v":"Ineligible reason1"}]
[1410,null,"45 to 64 yrs","F","Non-Hispanic/Latino","White","Yes","Yes","No","Employed","7 to 12","MSK","Non-work related","Non-workers comp","Industry 1","Occupation 3","Health provider","Worker’s comp database","County C","Phone",1,1,null,1,null,1,null,0,"Not enrolled reason1",0,null,"2019-10-09","2019-10-13","2019-11-03",null,null,{"$f":"IF(Table1[[#This Row],[First service received]]=1,\"Never dropped\",IF(Table1[[#This Row],[Enrolled]]=1,\"No first service\",IF(Table1[[#This Row],[Expressed interest]]=1,\"Not enrolled\",IF(Table1[[#This Row],[Eligible]]=1,\"Not interested\",IF(Table1[[#This Row],[Contacted]]=1,\"Not eligible\",IF(Table1[[#This Row],[Identified]]=1,\"Not contacted\",\"\"))))))","v":"Not enrolled"},{"$f":"_xlfn.CONCAT(Table1[[#This Row],[Reason not contacted]],Table1[[#This Row],[Reason not eligible]],Table1[[#This Row],[Reason not interested]],Table1[[#This Row],[Reason not enrolled]],Table1[[#This Row],[Reason first service not received]])","v":"Not enrolled reason1"}]
[1567,null,"25 to 44 yrs","F","Non-Hispanic/Latino","Other or 2 or more","Yes","Yes","No","Self-employed","13+ weeks","MSK","Non-work related","Non-workers comp","Industry 1","Occupation 1","Health provider","Work restriction forms","County B","Phone",1,1,null,1,null,0,"Impact on provider relationship",0,null,0,null,"2019-10-09","2019-10-24","2019-11-15",null,null,{"$f":"IF(Table1[[#This Row],[First service received]]=1,\"Never dropped\",IF(Table1[[#This Row],[Enrolled]]=1,\"No first service\",IF(Table1[[#This Row],[Expressed interest]]=1,\"Not enrolled\",IF(Table1[[#This Row],[Eligible]]=1,\"Not interested\",IF(Table1[[#This Row],[Contacted]]=1,\"Not eligible\",IF(Table1[[#This Row],[Identified]]=1,\"Not contacted\",\"\"))))))","v":"Not interested"},{"$f":"_xlfn.CONCAT(Table1[[#This Row],[Reason not contacted]],Table1[[#This Row],[Reason not eligible]],Table1[[#This Row],[Reason not interested]],Table1[[#This Row],[Reason not enrolled]],Table1[[#This Row],[Reason first service not received]])","v":"Impact on provider relationship"}]
[1113,null,"65 yrs +","M","Non-Hispanic/Latino","White","Yes","No","No","Employed","7 to 12","MSK","Non-work related","Non-workers comp","Industry 3","Occupation 3","Self","Electronic Health Records","County A","Phone",1,1,null,1,null,1,null,0,"Circumstances changed",0,null,"2019-10-10","2019-10-18","2019-11-27",null,null,{"$f":"IF(Table1[[#This Row],[First service received]]=1,\"Never dropped\",IF(Table1[[#This Row],[Enrolled]]=1,\"No first service\",IF(Table1[[#This Row],[Expressed interest]]=1,\"Not enrolled\",IF(Table1[[#This Row],[Eligible]]=1,\"Not interested\",IF(Table1[[#This Row],[Contacted]]=1,\"Not eligible\",IF(Table1[[#This Row],[Identified]]=1,\"Not contacted\",\"\"))))))","v":"Not enrolled"},{"$f":"_xlfn.CONCAT(Table1[[#This Row],[Reason not contacted]],Table1[[#This Row],[Reason not eligible]],Table1[[#This Row],[Reason not interested]],Table1[[#This Row],[Reason not enrolled]],Table1[[#This Row],[Reason first service not received]])","v":"Circumstances changed"}]
[1431,null,"45 to 64 yrs","M","Non-Hispanic/Latino","White","No","Yes","No","Self-employed","13+ weeks","Cardio or Respiratory","Work related","Non-workers comp","Industry 4","Occupation 1","Health provider","Work restriction forms","County B","Email",1,1,null,0,"Ineligible reason2",0,null,0,null,0,null,"2019-10-10","2019-10-13","2019-11-24",null,null,{"$f":"IF(Table1[[#This Row],[First service received]]=1,\"Never dropped\",IF(Table1[[#This Row],[Enrolled]]=1,\"No first service\",IF(Table1[[#This Row],[Expressed interest]]=1,\"Not enrolled\",IF(Table1[[#This Row],[Eligible]]=1,\"Not interested\",IF(Table1[[#This Row],[Contacted]]=1,\"Not eligible\",IF(Table1[[#This Row],[Identified]]=1,\"Not contacted\",\"\"))))))","v":"Not eligible"},{"$f":"_xlfn.CONCAT(Table1[[#This Row],[Reason not contacted]],Table1[[#This Row],[Reason not eligible]],Table1[[#This Row],[Reason not interested]],Table1[[#This Row],[Reason not enrolled]],Table1[[#This Row],[Reason first service not received]])","v":"Ineligible reason2"}]
[1539,null,"25 to 44 yrs","M","Non-Hispanic/Latino","White","Yes","Yes","No","Employed","7 to 12","MSK","Non-work related","Non-workers comp","Industry 3","Occupation 2","Self","Electronic Health Records","County B","Phone",1,1,null,0,"Ineligible reason3",0,null,0,null,0,null,"2019-10-11","2019-10-15","2019-11-27",null,null,{"$f":"IF(Table1[[#This Row],[First service received]]=1,\"Never dropped\",IF(Table1[[#This Row],[Enrolled]]=1,\"No first service\",IF(Table1[[#This Row],[Expressed interest]]=1,\"Not enrolled\",IF(Table1[[#This Row],[Eligible]]=1,\"Not interested\",IF(Table1[[#This Row],[Contacted]]=1,\"Not eligible\",IF(Table1[[#This Row],[Identified]]=1,\"Not contacted\",\"\"))))))","v":"Not eligible"},{"$f":"_xlfn.CONCAT(Table1[[#This Row],[Reason not contacted]],Table1[[#This Row],[Reason not eligible]],Table1[[#This Row],[Reason not interested]],Table1[[#This Row],[Reason not enrolled]],Table1[[#This Row],[Reason first service not received]])","v":"Ineligible reason3"}]
[1002,"lorem ipsum","45 to 64 yrs","M","Non-Hispanic/Latino","White","Yes","Yes","No","Employed","7 to 12","MSK","Work related","Workers comp","Industry 1","Occupation 3","Self","Electronic Health Records","County B","Phone",1,1,null,0,"Ineligible reason3",0,null,0,null,0,null,"2019-10-12","2019-10-18","2019-11-16",null,null,{"$f":"IF(Table1[[#This Row],[First service received]]=1,\"Never dropped\",IF(Table1[[#This Row],[Enrolled]]=1,\"No first service\",IF(Table1[[#This Row],[Expressed interest]]=1,\"Not enrolled\",IF(Table1[[#This Row],[Eligible]]=1,\"Not interested\",IF(Table1[[#This Row],[Contacted]]=1,\"Not eligible\",IF(Table1[[#This Row],[Identified]]=1,\"Not contacted\",\"\"))))))","v":"Not eligible"},{"$f":"_xlfn.CONCAT(Table1[[#This Row],[Reason not contacted]],Table1[[#This Row],[Reason not eligible]],Table1[[#This Row],[Reason not interested]],Table1[[#This Row],[Reason not enrolled]],Table1[[#This Row],[Reason first service not received]])","v":"Ineligible reason3"}]
[1140,null,"18 to 24 yrs","F","Non-Hispanic/Latino","White","Yes","No","No","Employed","13+ weeks","MSK","Non-work related","Non-workers comp","Industry 4","Occupation 3","Health provider","Clinic appointment schedules","County B","Phone",1,1,null,1,null,0,"Not interested reason3",0,null,0,null,"2019-10-12","2019-10-27","2019-11-13",null,null,{"$f":"IF(Table1[[#This Row],[First service received]]=1,\"Never dropped\",IF(Table1[[#This Row],[Enrolled]]=1,\"No first service\",IF(Table1[[#This Row],[Expressed interest]]=1,\"Not enrolled\",IF(Table1[[#This Row],[Eligible]]=1,\"Not interested\",IF(Table1[[#This Row],[Contacted]]=1,\"Not eligible\",IF(Table1[[#This Row],[Identified]]=1,\"Not contacted\",\"\"))))))","v":"Not interested"},{"$f":"_xlfn.CONCAT(Table1[[#This Row],[Reason not contacted]],Table1[[#This Row],[Reason not eligible]],Table1[[#This Row],[Reason not interested]],Table1[[#This Row],[Reason not enrolled]],Table1[[#This Row],[Reason first service not received]])","v":"Not interested reason3"}]
[1144,null,"25 to 44 yrs","M","Non-Hispanic/Latino","White","Yes","Yes","No","Employed","2 to 6","Other","Non-work related","Non-workers comp","Industry 1","Occupation 4","Health provider","Clinic appointment schedules","County C","Phone",1,1,null,0,"Ineligible reason1",0,null,0,null,0,null,"2019-10-12","2019-10-20","2019-11-17",null,null,{"$f":"IF(Table1[[#This Row],[First service received]]=1,\"Never dropped\",IF(Table1[[#This Row],[Enrolled]]=1,\"No first service\",IF(Table1[[#This Row],[Expressed interest]]=1,\"Not enrolled\",IF(Table1[[#This Row],[Eligible]]=1,\"Not interested\",IF(Table1[[#This Row],[Contacted]]=1,\"Not eligible\",IF(Table1[[#This Row],[Identified]]=1,\"Not contacted\",\"\"))))))","v":"Not eligible"},{"$f":"_xlfn.CONCAT(Table1[[#This Row],[Reason not contacted]],Table1[[#This Row],[Reason not eligible]],Table1[[#This Row],[Reason not interested]],Table1[[#This Row],[Reason not enrolled]],Table1[[#This Row],[Reason first service not received]])","v":"Ineligible reason1"}]
[1235,null,"18 to 24 yrs","M","Hispanic/Latino","White","No","Yes","No","Employed","13+ weeks","Cardio or Respiratory","Non-work related","Non-workers comp","Industry 3","Occupation 3","Workforce partner","Electronic Health Records","County C","Phone",1,1,null,1,null,0,"Don't want to be in research study",0,null,0,null,"2019-10-12","2019-10-24","2019-11-06",null,null,{"$f":"IF(Table1[[#This Row],[First service received]]=1,\"Never dropped\",IF(Table1[[#This Row],[Enrolled]]=1,\"No first service\",IF(Table1[[#This Row],[Expressed interest]]=1,\"Not enrolled\",IF(Table1[[#This Row],[Eligible]]=1,\"Not interested\",IF(Table1[[#This Row],[Contacted]]=1,\"Not eligible\",IF(Table1[[#This Row],[Identified]]=1,\"Not contacted\",\"\"))))))","v":"Not interested"},{"$f":"_xlfn.CONCAT(Table1[[#This Row],[Reason not contacted]],Table1[[#This Row],[Reason not eligible]],Table1[[#This Row],[Reason not interested]],Table1[[#This Row],[Reason not enrolled]],Table1[[#This Row],[Reason first service not received]])","v":"Don't want to be in research study"}]
[1015,null,"25 to 44 yrs","F","Non-Hispanic/Latino","White","Yes","Yes","No","Employed","0 to 1","MSK","Work related","Non-workers comp","Industry 1","Occupation 4","Health provider","Work restriction forms","County B","In person",1,0,"Contacted, no response",0,null,0,null,0,null,0,null,"2019-10-13",null,null,null,null,{"$f":"IF(Table1[[#This Row],[First service received]]=1,\"Never dropped\",IF(Table1[[#This Row],[Enrolled]]=1,\"No first service\",IF(Table1[[#This Row],[Expressed interest]]=1,\"Not enrolled\",IF(Table1[[#This Row],[Eligible]]=1,\"Not interested\",IF(Table1[[#This Row],[Contacted]]=1,\"Not eligible\",IF(Table1[[#This Row],[Identified]]=1,\"Not contacted\",\"\"))))))","v":"Not contacted"},{"$f":"_xlfn.CONCAT(Table1[[#This Row],[Reason not contacted]],Table1[[#This Row],[Reason not eligible]],Table1[[#This Row],[Reason not interested]],Table1[[#This Row],[Reason not enrolled]],Table1[[#This Row],[Reason first service not received]])","v":"Contacted, no response"}]
[1205,null,"65 yrs +","M","Non-Hispanic/Latino","White","Yes","Yes","No","Employed","13+ weeks","Other","Non-work related","Non-workers comp","Industry 3","Occupation 4","Health provider","Clinic appointment schedules","County C","Email",1,1,null,1,null,1,null,1,null,0,"Returned to work","2019-10-13","2019-10-16","2019-10-19","2019-11-04",null,{"$f":"IF(Table1[[#This Row],[First service received]]=1,\"Never dropped\",IF(Table1[[#This Row],[Enrolled]]=1,\"No first service\",IF(Table1[[#This Row],[Expressed interest]]=1,\"Not enrolled\",IF(Table1[[#This Row],[Eligible]]=1,\"Not interested\",IF(Table1[[#This Row],[Contacted]]=1,\"Not eligible\",IF(Table1[[#This Row],[Identified]]=1,\"Not contacted\",\"\"))))))","v":"No first service"},{"$f":"_xlfn.CONCAT(Table1[[#This Row],[Reason not contacted]],Table1[[#This Row],[Reason not eligible]],Table1[[#This Row],[Reason not interested]],Table1[[#This Row],[Reason not enrolled]],Table1[[#This Row],[Reason first service not received]])","v":"Returned to work"}]
[1282,null,"25 to 44 yrs","F","Non-Hispanic/Latino","White","No","Yes","No","Not Employed","0 to 1","MSK","Non-work related","Non-workers comp","Industry 3","Occupation 1","Health provider","Voc rehab centers","County A","Email",1,1,null,0,"Ineligible reason1",0,null,0,null,0,null,"2019-10-13","2019-10-14","2019-11-27",null,null,{"$f":"IF(Table1[[#This Row],[First service received]]=1,\"Never dropped\",IF(Table1[[#This Row],[Enrolled]]=1,\"No first service\",IF(Table1[[#This Row],[Expressed interest]]=1,\"Not enrolled\",IF(Table1[[#This Row],[Eligible]]=1,\"Not interested\",IF(Table1[[#This Row],[Contacted]]=1,\"Not eligible\",IF(Table1[[#This Row],[Identified]]=1,\"Not contacted\",\"\"))))))","v":"Not eligible"},{"$f":"_xlfn.CONCAT(Table1[[#This Row],[Reason not contacted]],Table1[[#This Row],[Reason not eligible]],Table1[[#This Row],[Reason not interested]],Table1[[#This Row],[Reason not enrolled]],Table1[[#This Row],[Reason first service not received]])","v":"Ineligible reason1"}]
[1356,null,"65 yrs +","M","Hispanic/Latino","White","Yes","Yes","No","Self-employed","13+ weeks","MSK","Non-work related","Non-workers comp","Industry 3","Occupation 1","Workforce partner","Electronic Health Records","County B","Phone",1,1,null,1,null,0,"Don't want to be in research study",0,null,0,null,"2019-10-13","2019-10-25","2019-11-14",null,null,{"$f":"IF(Table1[[#This Row],[First service received]]=1,\"Never dropped\",IF(Table1[[#This Row],[Enrolled]]=1,\"No first service\",IF(Table1[[#This Row],[Expressed interest]]=1,\"Not enrolled\",IF(Table1[[#This Row],[Eligible]]=1,\"Not interested\",IF(Table1[[#This Row],[Contacted]]=1,\"Not eligible\",IF(Table1[[#This Row],[Identified]]=1,\"Not contacted\",\"\"))))))","v":"Not interested"},{"$f":"_xlfn.CONCAT(Table1[[#This Row],[Reason not contacted]],Table1[[#This Row],[Reason not eligible]],Table1[[#This Row],[Reason not interested]],Table1[[#This Row],[Reason not enrolled]],Table1[[#This Row],[Reason first service not received]])","v":"Don't want to be in research study"}]
[1401,null,"18 to 24 yrs","F","Hispanic/Latino","White","Yes","Yes","No","Employed","7 to 12","Other","Work related","Workers comp","Industry 1","Occupation 1","Health provider","Voc rehab centers","County B","Phone",1,1,null,1,null,0,"Don't want to be in research study",0,null,0,null,"2019-10-13","2019-10-16","2019-11-09",null,null,{"$f":"IF(Table1[[#This Row],[First service received]]=1,\"Never dropped\",IF(Table1[[#This Row],[Enrolled]]=1,\"No first service\",IF(Table1[[#This Row],[Expressed interest]]=1,\"Not enrolled\",IF(Table1[[#This Row],[Eligible]]=1,\"Not interested\",IF(Table1[[#This Row],[Contacted]]=1,\"Not eligible\",IF(Table1[[#This Row],[Identified]]=1,\"Not contacted\",\"\"))))))","v":"Not interested"},{"$f":"_xlfn.CONCAT(Table1[[#This Row],[Reason not contacted]],Table1[[#This Row],[Reason not eligible]],Table1[[#This Row],[Reason not interested]],Table1[[#This Row],[Reason not enrolled]],Table1[[#This Row],[Reason first service not received]])","v":"Don't want to be in research study"}]
[1473,null,"25 to 44 yrs","F","Non-Hispanic/Latino","White","No","Yes","No","Self-employed","13+ weeks","MSK","Non-work related","Non-workers comp","Industry 4","Occupation 1","Health provider","Worker’s comp database","County C","In person",1,1,null,0,"Ineligible reason1",0,null,0,null,0,null,"2019-10-13","2019-10-28","2019-12-01",null,null,{"$f":"IF(Table1[[#This Row],[First service received]]=1,\"Never dropped\",IF(Table1[[#This Row],[Enrolled]]=1,\"No first service\",IF(Table1[[#This Row],[Expressed interest]]=1,\"Not enrolled\",IF(Table1[[#This Row],[Eligible]]=1,\"Not interested\",IF(Table1[[#This Row],[Contacted]]=1,\"Not eligible\",IF(Table1[[#This Row],[Identified]]=1,\"Not contacted\",\"\"))))))","v":"Not eligible"},{"$f":"_xlfn.CONCAT(Table1[[#This Row],[Reason not contacted]],Table1[[#This Row],[Reason not eligible]],Table1[[#This Row],[Reason not interested]],Table1[[#This Row],[Reason not enrolled]],Table1[[#This Row],[Reason first service not received]])","v":"Ineligible reason1"}]
[1327,null,"25 to 44 yrs","M","Non-Hispanic/Latino","White","No","Yes","No","Employed","7 to 12","Cardio or Respiratory","Non-work related","Non-workers comp","Industry 1","Occupation 3","Health provider","Voc rehab centers","County B","Phone",1,0,"Contacted, no response",0,null,0,null,0,null,0,null,"2019-10-15",null,null,null,null,{"$f":"IF(Table1[[#This Row],[First service received]]=1,\"Never dropped\",IF(Table1[[#This Row],[Enrolled]]=1,\"No first service\",IF(Table1[[#This Row],[Expressed interest]]=1,\"Not enrolled\",IF(Table1[[#This Row],[Eligible]]=1,\"Not interested\",IF(Table1[[#This Row],[Contacted]]=1,\"Not eligible\",IF(Table1[[#This Row],[Identified]]=1,\"Not contacted\",\"\"))))))","v":"Not contacted"},{"$f":"_xlfn.CONCAT(Table1[[#This Row],[Reason not contacted]],Table1[[#This Row],[Reason not eligible]],Table1[[#This Row],[Reason not interested]],Table1[[#This Row],[Reason not enrolled]],Table1[[#This Row],[Reason first service not received]])","v":"Contacted, no response"}]
[1405,null,"45 to 64 yrs","M","Non-Hispanic/Latino","White","Yes","Yes","No","Employed","0 to 1","Other","Non-work related","Non-workers comp","Industry 3","Occupation 2","Employer","Electronic Health Records","County B","Email",1,0,"Contacted, no response",0,null,0,null,0,null,0,null,"2019-10-15",null,null,null,null,{"$f":"IF(Table1[[#This Row],[First service received]]=1,\"Never dropped\",IF(Table1[[#This Row],[Enrolled]]=1,\"No first service\",IF(Table1[[#This Row],[Expressed interest]]=1,\"Not enrolled\",IF(Table1[[#This Row],[Eligible]]=1,\"Not interested\",IF(Table1[[#This Row],[Contacted]]=1,\"Not eligible\",IF(Table1[[#This Row],[Identified]]=1,\"Not contacted\",\"\"))))))","v":"Not contacted"},{"$f":"_xlfn.CONCAT(Table1[[#This Row],[Reason not contacted]],Table1[[#This Row],[Reason not eligible]],Table1[[#This Row],[Reason not interested]],Table1[[#This Row],[Reason not enrolled]],Table1[[#This Row],[Reason first service not received]])","v":"Contacted, no response"}]
[1009,"lorem ipsum","25 to 44 yrs","M","Non-Hispanic/Latino","White","Yes","Yes","No","Not Employed","0 to 1","MSK","Non-work related","Non-workers comp","Industry 4","Occupation 3","Workforce partner","Electronic Health Records","County B","Phone",1,1,null,1,null,1,null,1,null,1,null,"2019-10-16","2019-10-29","2019-11-12","2019-11-22","2019-11-25",{"$f":"IF(Table1[[#This Row],[First service received]]=1,\"Never dropped\",IF(Table1[[#This Row],[Enrolled]]=1,\"No first service\",IF(Table1[[#This Row],[Expressed interest]]=1,\"Not enrolled\",IF(Table1[[#This Row],[Eligible]]=1,\"Not interested\",IF(Table1[[#This Row],[Contacted]]=1,\"Not eligible\",IF(Table1[[#This Row],[Identified]]=1,\"Not contacted\",\"\"))))))","v":"Never dropped"},{"$f":"_xlfn.CONCAT(Table1[[#This Row],[Reason not contacted]],Table1[[#This Row],[Reason not eligible]],Table1[[#This Row],[Reason not interested]],Table1[[#This Row],[Reason not enrolled]],Table1[[#This Row],[Reason first service not received]])","v":""}]
[1021,"lorem ipsum","45 to 64 yrs","M","Non-Hispanic/Latino","White","Yes","Yes","No","Employed","13+ weeks","Other","Work related","Non-workers comp","Industry 4","Occupation 3","Health provider","Voc rehab centers","County A","Phone",1,1,null,1,null,1,null,0,"Circumstances changed",0,null,"2019-10-16","2019-10-20","2019-11-13",null,null,{"$f":"IF(Table1[[#This Row],[First service received]]=1,\"Never dropped\",IF(Table1[[#This Row],[Enrolled]]=1,\"No first service\",IF(Table1[[#This Row],[Expressed interest]]=1,\"Not enrolled\",IF(Table1[[#This Row],[Eligible]]=1,\"Not interested\",IF(Table1[[#This Row],[Contacted]]=1,\"Not eligible\",IF(Table1[[#This Row],[Identified]]=1,\"Not contacted\",\"\"))))))","v":"Not enrolled"},{"$f":"_xlfn.CONCAT(Table1[[#This Row],[Reason not contacted]],Table1[[#This Row],[Reason not eligible]],Table1[[#This Row],[Reason not interested]],Table1[[#This Row],[Reason not enrolled]],Table1[[#This Row],[Reason first service not received]])","v":"Circumstances changed"}]
[1029,null,"45 to 64 yrs","F","Hispanic/Latino","White","No","Yes","No","Employed","2 to 6","MSK","Non-work related","Non-workers comp","Industry 3","Occupation 2","Employer","Electronic Health Records","County A","In person",1,1,null,1,null,0,"Don't want to be in research study",0,null,0,null,"2019-10-16","2019-10-20","2019-11-18",null,null,{"$f":"IF(Table1[[#This Row],[First service received]]=1,\"Never dropped\",IF(Table1[[#This Row],[Enrolled]]=1,\"No first service\",IF(Table1[[#This Row],[Expressed interest]]=1,\"Not enrolled\",IF(Table1[[#This Row],[Eligible]]=1,\"Not interested\",IF(Table1[[#This Row],[Contacted]]=1,\"Not eligible\",IF(Table1[[#This Row],[Identified]]=1,\"Not contacted\",\"\"))))))","v":"Not interested"},{"$f":"_xlfn.CONCAT(Table1[[#This Row],[Reason not contacted]],Table1[[#This Row],[Reason not eligible]],Table1[[#This Row],[Reason not interested]],Table1[[#This Row],[Reason not enrolled]],Table1[[#This Row],[Reason first service not received]])","v":"Don't want to be in research study"}]
[1139,null,"45 to 64 yrs","M","Non-Hispanic/Latino","White","Yes","Yes","No","Not Employed","0 to 1","MSK","Non-work related","Non-workers comp","Industry 4","Occupation 4","Employer","Electronic Health Records","County A","Other",1,0,"Inaccurate contact info",0,null,0,null,0,null,0,null,"2019-10-17",null,null,null,null,{"$f":"IF(Table1[[#This Row],[First service received]]=1,\"Never dropped\",IF(Table1[[#This Row],[Enrolled]]=1,\"No first service\",IF(Table1[[#This Row],[Expressed interest]]=1,\"Not enrolled\",IF(Table1[[#This Row],[Eligible]]=1,\"Not interested\",IF(Table1[[#This Row],[Contacted]]=1,\"Not eligible\",IF(Table1[[#This Row],[Identified]]=1,\"Not contacted\",\"\"))))))","v":"Not contacted"},{"$f":"_xlfn.CONCAT(Table1[[#This Row],[Reason not contacted]],Table1[[#This Row],[Reason not eligible]],Table1[[#This Row],[Reason not interested]],Table1[[#This Row],[Reason not enrolled]],Table1[[#This Row],[Reason first service not received]])","v":"Inaccurate contact info"}]
[1558,null,"18 to 24 yrs","F","Non-Hispanic/Latino","White","Yes","No","No","Employed","2 to 6","Cardio or Respiratory","Work related","Non-workers comp","Industry 3","Occupation 1","Employer","Electronic Health Records","County B","Email",1,1,null,1,null,1,null,1,null,1,null,"2019-10-17","2019-10-22","2019-10-22","2019-11-21","2019-11-24",{"$f":"IF(Table1[[#This Row],[First service received]]=1,\"Never dropped\",IF(Table1[[#This Row],[Enrolled]]=1,\"No first service\",IF(Table1[[#This Row],[Expressed interest]]=1,\"Not enrolled\",IF(Table1[[#This Row],[Eligible]]=1,\"Not interested\",IF(Table1[[#This Row],[Contacted]]=1,\"Not eligible\",IF(Table1[[#This Row],[Identified]]=1,\"Not contacted\",\"\"))))))","v":"Never dropped"},{"$f":"_xlfn.CONCAT(Table1[[#This Row],[Reason not contacted]],Table1[[#This Row],[Reason not eligible]],Table1[[#This Row],[Reason not interested]],Table1[[#This Row],[Reason not enrolled]],Table1[[#This Row],[Reason first service not received]])","v":""}]
[1145,null,"45 to 64 yrs","F","Non-Hispanic/Latino","Black or African-American","Yes","Yes","No","Employed","2 to 6","MSK","Non-work related","Non-workers comp","Industry 4","Occupation 4","Health provider","Voc rehab centers","County C","Email",1,1,null,1,null,0,"Impact on provider relationship",0,null,0,null,"2019-10-18","2019-10-30","2019-11-04",null,null,{"$f":"IF(Table1[[#This Row],[First service received]]=1,\"Never dropped\",IF(Table1[[#This Row],[Enrolled]]=1,\"No first service\",IF(Table1[[#This Row],[Expressed interest]]=1,\"Not enrolled\",IF(Table1[[#This Row],[Eligible]]=1,\"Not interested\",IF(Table1[[#This Row],[Contacted]]=1,\"Not eligible\",IF(Table1[[#This Row],[Identified]]=1,\"Not contacted\",\"\"))))))","v":"Not interested"},{"$f":"_xlfn.CONCAT(Table1[[#This Row],[Reason not contacted]],Table1[[#This Row],[Reason not eligible]],Table1[[#This Row],[Reason not interested]],Table1[[#This Row],[Reason not enrolled]],Table1[[#This Row],[Reason first service not received]])","v":"Impact on provider relationship"}]
[1317,null,"45 to 64 yrs","M","Non-Hispanic/Latino","American Indian or Alaska Native","Yes","Yes","No","Employed","2 to 6","MSK","Non-work related","Non-workers comp","Industry 1","Occupation 1","Health provider","Worker’s comp database","County B","Phone",1,1,null,0,"Ineligible reason1",0,null,0,null,0,null,"2019-10-18","2019-10-20","2019-11-19",null,null,{"$f":"IF(Table1[[#This Row],[First service received]]=1,\"Never dropped\",IF(Table1[[#This Row],[Enrolled]]=1,\"No first service\",IF(Table1[[#This Row],[Expressed interest]]=1,\"Not enrolled\",IF(Table1[[#This Row],[Eligible]]=1,\"Not interested\",IF(Table1[[#This Row],[Contacted]]=1,\"Not eligible\",IF(Table1[[#This Row],[Identified]]=1,\"Not contacted\",\"\"))))))","v":"Not eligible"},{"$f":"_xlfn.CONCAT(Table1[[#This Row],[Reason not contacted]],Table1[[#This Row],[Reason not eligible]],Table1[[#This Row],[Reason not interested]],Table1[[#This Row],[Reason not enrolled]],Table1[[#This Row],[Reason first service not received]])","v":"Ineligible reason1"}]
[1378,null,"18 to 24 yrs","F","Non-Hispanic/Latino","White","Yes","No","No","Employed","2 to 6","Cardio or Respiratory","Work related","Non-workers comp","Industry 3","Occupation 1","Employer","Electronic Health Records","County B","Other",1,0,"Inaccurate contact info",0,null,0,null,0,null,0,null,"2019-10-18",null,null,null,null,{"$f":"IF(Table1[[#This Row],[First service received]]=1,\"Never dropped\",IF(Table1[[#This Row],[Enrolled]]=1,\"No first service\",IF(Table1[[#This Row],[Expressed interest]]=1,\"Not enrolled\",IF(Table1[[#This Row],[Eligible]]=1,\"Not interested\",IF(Table1[[#This Row],[Contacted]]=1,\"Not eligible\",IF(Table1[[#This Row],[Identified]]=1,\"Not contacted\",\"\"))))))","v":"Not contacted"},{"$f":"_xlfn.CONCAT(Table1[[#This Row],[Reason not contacted]],Table1[[#This Row],[Reason not eligible]],Table1[[#This Row],[Reason not interested]],Table1[[#This Row],[Reason not enrolled]],Table1[[#This Row],[Reason first service not received]])","v":"Inaccurate contact info"}]
[1414,null,"25 to 44 yrs","F","Non-Hispanic/Latino","Black or African-American","No","Yes","No","Employed","2 to 6","Other","Work related","Non-workers comp","Industry 1","Occupation 1","Health provider","Worker’s comp database","County B","In person",1,1,null,1,null,0,"Don't want to be in research study",0,null,0,null,"2019-10-18","2019-10-22","2019-11-09",null,null,{"$f":"IF(Table1[[#This Row],[First service received]]=1,\"Never dropped\",IF(Table1[[#This Row],[Enrolled]]=1,\"No first service\",IF(Table1[[#This Row],[Expressed interest]]=1,\"Not enrolled\",IF(Table1[[#This Row],[Eligible]]=1,\"Not interested\",IF(Table1[[#This Row],[Contacted]]=1,\"Not eligible\",IF(Table1[[#This Row],[Identified]]=1,\"Not contacted\",\"\"))))))","v":"Not interested"},{"$f":"_xlfn.CONCAT(Table1[[#This Row],[Reason not contacted]],Table1[[#This Row],[Reason not eligible]],Table1[[#This Row],[Reason not interested]],Table1[[#This Row],[Reason not enrolled]],Table1[[#This Row],[Reason first service not received]])","v":"Don't want to be in research study"}]
[1485,null,"45 to 64 yrs","M","Non-Hispanic/Latino","White","Yes","Yes","No","Employed","7 to 12","MSK","Work related","Non-workers comp","Industry 2","Occupation 3","Health provider","Worker’s comp database","County A","Phone",1,1,null,1,null,1,null,0,"Circumstances changed",0,null,"2019-10-18","2019-10-21","2019-11-11",null,null,{"$f":"IF(Table1[[#This Row],[First service received]]=1,\"Never dropped\",IF(Table1[[#This Row],[Enrolled]]=1,\"No first service\",IF(Table1[[#This Row],[Expressed interest]]=1,\"Not enrolled\",IF(Table1[[#This Row],[Eligible]]=1,\"Not interested\",IF(Table1[[#This Row],[Contacted]]=1,\"Not eligible\",IF(Table1[[#This Row],[Identified]]=1,\"Not contacted\",\"\"))))))","v":"Not enrolled"},{"$f":"_xlfn.CONCAT(Table1[[#This Row],[Reason not contacted]],Table1[[#This Row],[Reason not eligible]],Table1[[#This Row],[Reason not interested]],Table1[[#This Row],[Reason not enrolled]],Table1[[#This Row],[Reason first service not received]])","v":"Circumstances changed"}]
[1586,null,"25 to 44 yrs","M","Non-Hispanic/Latino","White","Yes","Yes","No","Employed","7 to 12","MSK","Work related","Workers comp","Industry 1","Occupation 1","Health provider","Clinic appointment schedules","County B","Phone",1,1,null,1,null,1,null,1,null,0,"No show","2019-10-18","2019-10-26","2019-11-08","2019-11-19",null,{"$f":"IF(Table1[[#This Row],[First service received]]=1,\"Never dropped\",IF(Table1[[#This Row],[Enrolled]]=1,\"No first service\",IF(Table1[[#This Row],[Expressed interest]]=1,\"Not enrolled\",IF(Table1[[#This Row],[Eligible]]=1,\"Not interested\",IF(Table1[[#This Row],[Contacted]]=1,\"Not eligible\",IF(Table1[[#This Row],[Identified]]=1,\"Not contacted\",\"\"))))))","v":"No first service"},{"$f":"_xlfn.CONCAT(Table1[[#This Row],[Reason not contacted]],Table1[[#This Row],[Reason not eligible]],Table1[[#This Row],[Reason not interested]],Table1[[#This Row],[Reason not enrolled]],Table1[[#This Row],[Reason first service not received]])","v":"No show"}]
[1108,null,"45 to 64 yrs","M","Non-Hispanic/Latino","Other or 2 or more","Yes","Yes","No","Not Employed","0 to 1","Other","Non-work related","Non-workers comp","Industry 2","Occupation 3","Health provider","FMLA forms","County B","Other",1,0,"Inaccurate contact info",0,null,0,null,0,null,0,null,"2019-10-19",null,null,null,null,{"$f":"IF(Table1[[#This Row],[First service received]]=1,\"Never dropped\",IF(Table1[[#This Row],[Enrolled]]=1,\"No first service\",IF(Table1[[#This Row],[Expressed interest]]=1,\"Not enrolled\",IF(Table1[[#This Row],[Eligible]]=1,\"Not interested\",IF(Table1[[#This Row],[Contacted]]=1,\"Not eligible\",IF(Table1[[#This Row],[Identified]]=1,\"Not contacted\",\"\"))))))","v":"Not contacted"},{"$f":"_xlfn.CONCAT(Table1[[#This Row],[Reason not contacted]],Table1[[#This Row],[Reason not eligible]],Table1[[#This Row],[Reason not interested]],Table1[[#This Row],[Reason not enrolled]],Table1[[#This Row],[Reason first service not received]])","v":"Inaccurate contact info"}]
[1200,null,"25 to 44 yrs","M","Non-Hispanic/Latino","White","Yes","Yes","No","Employed","7 to 12","MSK","Work related","Workers comp","Industry 3","Occupation 2","Health provider","Worker’s comp database","County B","Email",1,0,"Inaccurate contact info",0,null,0,null,0,null,0,null,"2019-10-19",null,null,null,null,{"$f":"IF(Table1[[#This Row],[First service received]]=1,\"Never dropped\",IF(Table1[[#This Row],[Enrolled]]=1,\"No first service\",IF(Table1[[#This Row],[Expressed interest]]=1,\"Not enrolled\",IF(Table1[[#This Row],[Eligible]]=1,\"Not interested\",IF(Table1[[#This Row],[Contacted]]=1,\"Not eligible\",IF(Table1[[#This Row],[Identified]]=1,\"Not contacted\",\"\"))))))","v":"Not contacted"},{"$f":"_xlfn.CONCAT(Table1[[#This Row],[Reason not contacted]],Table1[[#This Row],[Reason not eligible]],Table1[[#This Row],[Reason not interested]],Table1[[#This Row],[Reason not enrolled]],Table1[[#This Row],[Reason first service not received]])","v":"Inaccurate contact info"}]
[1338,null,"45 to 64 yrs","M","Non-Hispanic/Latino","White","Yes","Yes","No","Employed","2 to 6","MSK","Work related","Workers comp","Industry 1","Occupation 3","Self","Electronic Health Records","County A","Phone",1,1,null,1,null,1,null,1,null,1,null,"2019-10-19","2019-10-22","2019-10-23","2019-11-11","2019-11-24",{"$f":"IF(Table1[[#This Row],[First service received]]=1,\"Never dropped\",IF(Table1[[#This Row],[Enrolled]]=1,\"No first service\",IF(Table1[[#This Row],[Expressed interest]]=1,\"Not enrolled\",IF(Table1[[#This Row],[Eligible]]=1,\"Not interested\",IF(Table1[[#This Row],[Contacted]]=1,\"Not eligible\",IF(Table1[[#This Row],[Identified]]=1,\"Not contacted\",\"\"))))))","v":"Never dropped"},{"$f":"_xlfn.CONCAT(Table1[[#This Row],[Reason not contacted]],Table1[[#This Row],[Reason not eligible]],Table1[[#This Row],[Reason not interested]],Table1[[#This Row],[Reason not enrolled]],Table1[[#This Row],[Reason first service not received]])","v":""}]
[1384,null,"25 to 44 yrs","M","Non-Hispanic/Latino","White","Yes","Yes","No","Employed","13+ weeks","MSK","Non-work related","Non-workers comp","Industry 1","Occupation 3","Workforce partner","Electronic Health Records","County B","Phone",1,1,null,1,null,1,null,1,null,1,null,"2019-10-19","2019-11-02","2019-11-08","2019-11-25","2019-11-29",{"$f":"IF(Table1[[#This Row],[First service received]]=1,\"Never dropped\",IF(Table1[[#This Row],[Enrolled]]=1,\"No first service\",IF(Table1[[#This Row],[Expressed interest]]=1,\"Not enrolled\",IF(Table1[[#This Row],[Eligible]]=1,\"Not interested\",IF(Table1[[#This Row],[Contacted]]=1,\"Not eligible\",IF(Table1[[#This Row],[Identified]]=1,\"Not contacted\",\"\"))))))","v":"Never dropped"},{"$f":"_xlfn.CONCAT(Table1[[#This Row],[Reason not contacted]],Table1[[#This Row],[Reason not eligible]],Table1[[#This Row],[Reason not interested]],Table1[[#This Row],[Reason not enrolled]],Table1[[#This Row],[Reason first service not received]])","v":""}]
[1416,null,"65 yrs +","M","Non-Hispanic/Latino","White","Yes","Yes","No","Employed","0 to 1","MSK","Non-work related","Non-workers comp","Industry 1","Occupation 3","Workforce partner","Electronic Health Records","County C","Phone",1,0,"Contacted, no response",0,null,0,null,0,null,0,null,"2019-10-19",null,null,null,null,{"$f":"IF(Table1[[#This Row],[First service received]]=1,\"Never dropped\",IF(Table1[[#This Row],[Enrolled]]=1,\"No first service\",IF(Table1[[#This Row],[Expressed interest]]=1,\"Not enrolled\",IF(Table1[[#This Row],[Eligible]]=1,\"Not interested\",IF(Table1[[#This Row],[Contacted]]=1,\"Not eligible\",IF(Table1[[#This Row],[Identified]]=1,\"Not contacted\",\"\"))))))","v":"Not contacted"},{"$f":"_xlfn.CONCAT(Table1[[#This Row],[Reason not contacted]],Table1[[#This Row],[Reason not eligible]],Table1[[#This Row],[Reason not interested]],Table1[[#This Row],[Reason not enrolled]],Table1[[#This Row],[Reason first service not received]])","v":"Contacted, no response"}]
[1417,null,"25 to 44 yrs","F","Non-Hispanic/Latino","White","Yes","No","No","Not Employed","0 to 1","MSK","Non-work related","Non-workers comp","Industry 1","Occupation 3","Health provider","Worker’s comp database","County C","Phone",1,1,null,1,null,0,"Impact on provider relationship",0,null,0,null,"2019-10-19","2019-10-21","2019-12-05",null,null,{"$f":"IF(Table1[[#This Row],[First service received]]=1,\"Never dropped\",IF(Table1[[#This Row],[Enrolled]]=1,\"No first service\",IF(Table1[[#This Row],[Expressed interest]]=1,\"Not enrolled\",IF(Table1[[#This Row],[Eligible]]=1,\"Not interested\",IF(Table1[[#This Row],[Contacted]]=1,\"Not eligible\",IF(Table1[[#This Row],[Identified]]=1,\"Not contacted\",\"\"))))))","v":"Not interested"},{"$f":"_xlfn.CONCAT(Table1[[#This Row],[Reason not contacted]],Table1[[#This Row],[Reason not eligible]],Table1[[#This Row],[Reason not interested]],Table1[[#This Row],[Reason not enrolled]],Table1[[#This Row],[Reason first service not received]])","v":"Impact on provider relationship"}]
[1475,null,"45 to 64 yrs","M","Hispanic/Latino","White","Yes","Yes","No","Not Employed","0 to 1","MSK","Non-work related","Non-workers comp","Industry 3","Occupation 4","Workforce partner","Electronic Health Records","County B","Phone",1,1,null,1,null,0,"Impact on provider relationship",0,null,0,null,"2019-10-19","2019-10-26","2019-11-03",null,null,{"$f":"IF(Table1[[#This Row],[First service received]]=1,\"Never dropped\",IF(Table1[[#This Row],[Enrolled]]=1,\"No first service\",IF(Table1[[#This Row],[Expressed interest]]=1,\"Not enrolled\",IF(Table1[[#This Row],[Eligible]]=1,\"Not interested\",IF(Table1[[#This Row],[Contacted]]=1,\"Not eligible\",IF(Table1[[#This Row],[Identified]]=1,\"Not contacted\",\"\"))))))","v":"Not interested"},{"$f":"_xlfn.CONCAT(Table1[[#This Row],[Reason not contacted]],Table1[[#This Row],[Reason not eligible]],Table1[[#This Row],[Reason not interested]],Table1[[#This Row],[Reason not enrolled]],Table1[[#This Row],[Reason first service not received]])","v":"Impact on provider relationship"}]
[1593,null,"45 to 64 yrs","F","Non-Hispanic/Latino","White","Yes","Yes","No","Not Employed","0 to 1","Cardio or Respiratory","Work related","Workers comp","Industry 1","Occupation 3","Workforce partner","Electronic Health Records","County A","Phone",1,1,null,0,"Ineligible reason3",0,null,0,null,0,null,"2019-10-19","2019-10-31","2019-12-06",null,null,{"$f":"IF(Table1[[#This Row],[First service received]]=1,\"Never dropped\",IF(Table1[[#This Row],[Enrolled]]=1,\"No first service\",IF(Table1[[#This Row],[Expressed interest]]=1,\"Not enrolled\",IF(Table1[[#This Row],[Eligible]]=1,\"Not interested\",IF(Table1[[#This Row],[Contacted]]=1,\"Not eligible\",IF(Table1[[#This Row],[Identified]]=1,\"Not contacted\",\"\"))))))","v":"Not eligible"},{"$f":"_xlfn.CONCAT(Table1[[#This Row],[Reason not contacted]],Table1[[#This Row],[Reason not eligible]],Table1[[#This Row],[Reason not interested]],Table1[[#This Row],[Reason not enrolled]],Table1[[#This Row],[Reason first service not received]])","v":"Ineligible reason3"}]
[1610,null,"25 to 44 yrs","M","Non-Hispanic/Latino","White","Yes","Yes","No","Employed","2 to 6","MSK","Work related","Workers comp","Industry 1","Occupation 3","Health provider","Voc rehab centers","County B","Email",1,1,null,0,"Ineligible reason2",0,null,0,null,0,null,"2019-10-19","2019-10-29","2019-11-12",null,null,{"$f":"IF(Table1[[#This Row],[First service received]]=1,\"Never dropped\",IF(Table1[[#This Row],[Enrolled]]=1,\"No first service\",IF(Table1[[#This Row],[Expressed interest]]=1,\"Not enrolled\",IF(Table1[[#This Row],[Eligible]]=1,\"Not interested\",IF(Table1[[#This Row],[Contacted]]=1,\"Not eligible\",IF(Table1[[#This Row],[Identified]]=1,\"Not contacted\",\"\"))))))","v":"Not eligible"},{"$f":"_xlfn.CONCAT(Table1[[#This Row],[Reason not contacted]],Table1[[#This Row],[Reason not eligible]],Table1[[#This Row],[Reason not interested]],Table1[[#This Row],[Reason not enrolled]],Table1[[#This Row],[Reason first service not received]])","v":"Ineligible reason2"}]
[1078,null,"25 to 44 yrs","F","Non-Hispanic/Latino","White","Yes","Yes","No","Employed","2 to 6","Other","Non-work related","Non-workers comp","Industry 1","Occupation 3","Health provider","Worker’s comp database","County A","Phone",1,1,null,0,"Ineligible reason1",0,null,0,null,0,null,"2019-10-20","2019-10-31","2019-12-12",null,null,{"$f":"IF(Table1[[#This Row],[First service received]]=1,\"Never dropped\",IF(Table1[[#This Row],[Enrolled]]=1,\"No first service\",IF(Table1[[#This Row],[Expressed interest]]=1,\"Not enrolled\",IF(Table1[[#This Row],[Eligible]]=1,\"Not interested\",IF(Table1[[#This Row],[Contacted]]=1,\"Not eligible\",IF(Table1[[#This Row],[Identified]]=1,\"Not contacted\",\"\"))))))","v":"Not eligible"},{"$f":"_xlfn.CONCAT(Table1[[#This Row],[Reason not contacted]],Table1[[#This Row],[Reason not eligible]],Table1[[#This Row],[Reason not interested]],Table1[[#This Row],[Reason not enrolled]],Table1[[#This Row],[Reason first service not received]])","v":"Ineligible reason1"}]
[1231,null,"25 to 44 yrs","F","Non-Hispanic/Latino","Black or African-American","Yes","Yes","No","Not Employed","0 to 1","Cardio or Respiratory","Non-work related","Non-workers comp","Industry 3","Occupation 2","Health provider","Clinic appointment schedules","County C","Phone",1,1,null,1,null,1,null,1,null,1,null,"2019-10-20","2019-11-02","2019-11-02","2019-12-02","2019-12-05",{"$f":"IF(Table1[[#This Row],[First service received]]=1,\"Never dropped\",IF(Table1[[#This Row],[Enrolled]]=1,\"No first service\",IF(Table1[[#This Row],[Expressed interest]]=1,\"Not enrolled\",IF(Table1[[#This Row],[Eligible]]=1,\"Not interested\",IF(Table1[[#This Row],[Contacted]]=1,\"Not eligible\",IF(Table1[[#This Row],[Identified]]=1,\"Not contacted\",\"\"))))))","v":"Never dropped"},{"$f":"_xlfn.CONCAT(Table1[[#This Row],[Reason not contacted]],Table1[[#This Row],[Reason not eligible]],Table1[[#This Row],[Reason not interested]],Table1[[#This Row],[Reason not enrolled]],Table1[[#This Row],[Reason first service not received]])","v":""}]
[1275,null,"25 to 44 yrs","M","Non-Hispanic/Latino","White","Yes","Yes","No","Employed","13+ weeks","MSK","Non-work related","Non-workers comp","Industry 4","Occupation 3","Health provider","Worker’s comp database","County B","Phone",1,1,null,0,"Ineligible reason3",0,null,0,null,0,null,"2019-10-20","2019-10-25","2019-10-28",null,null,{"$f":"IF(Table1[[#This Row],[First service received]]=1,\"Never dropped\",IF(Table1[[#This Row],[Enrolled]]=1,\"No first service\",IF(Table1[[#This Row],[Expressed interest]]=1,\"Not enrolled\",IF(Table1[[#This Row],[Eligible]]=1,\"Not interested\",IF(Table1[[#This Row],[Contacted]]=1,\"Not eligible\",IF(Table1[[#This Row],[Identified]]=1,\"Not contacted\",\"\"))))))","v":"Not eligible"},{"$f":"_xlfn.CONCAT(Table1[[#This Row],[Reason not contacted]],Table1[[#This Row],[Reason not eligible]],Table1[[#This Row],[Reason not interested]],Table1[[#This Row],[Reason not enrolled]],Table1[[#This Row],[Reason first service not received]])","v":"Ineligible reason3"}]
[1292,null,"45 to 64 yrs","M","Non-Hispanic/Latino","American Indian or Alaska Native","Yes","Yes","No","Employed","7 to 12","MSK","Non-work related","Non-workers comp","Industry 2","Occupation 3","Health provider","FMLA forms","County B","Phone",1,1,null,1,null,1,null,1,null,1,null,"2019-10-20","2019-11-02","2019-11-06","2019-11-16","2019-11-17",{"$f":"IF(Table1[[#This Row],[First service received]]=1,\"Never dropped\",IF(Table1[[#This Row],[Enrolled]]=1,\"No first service\",IF(Table1[[#This Row],[Expressed interest]]=1,\"Not enrolled\",IF(Table1[[#This Row],[Eligible]]=1,\"Not interested\",IF(Table1[[#This Row],[Contacted]]=1,\"Not eligible\",IF(Table1[[#This Row],[Identified]]=1,\"Not contacted\",\"\"))))))","v":"Never dropped"},{"$f":"_xlfn.CONCAT(Table1[[#This Row],[Reason not contacted]],Table1[[#This Row],[Reason not eligible]],Table1[[#This Row],[Reason not interested]],Table1[[#This Row],[Reason not enrolled]],Table1[[#This Row],[Reason first service not received]])","v":""}]
[1386,null,"25 to 44 yrs","M","Non-Hispanic/Latino","White","Yes","Yes","No","Not Employed","0 to 1","MSK","Work related","Non-workers comp","Industry 1","Occupation 3","Health provider","Clinic appointment schedules","County B","Email",1,1,null,1,null,1,null,1,null,1,null,"2019-10-20","2019-10-29","2019-11-08","2019-11-18","2019-12-01",{"$f":"IF(Table1[[#This Row],[First service received]]=1,\"Never dropped\",IF(Table1[[#This Row],[Enrolled]]=1,\"No first service\",IF(Table1[[#This Row],[Expressed interest]]=1,\"Not enrolled\",IF(Table1[[#This Row],[Eligible]]=1,\"Not interested\",IF(Table1[[#This Row],[Contacted]]=1,\"Not eligible\",IF(Table1[[#This Row],[Identified]]=1,\"Not contacted\",\"\"))))))","v":"Never dropped"},{"$f":"_xlfn.CONCAT(Table1[[#This Row],[Reason not contacted]],Table1[[#This Row],[Reason not eligible]],Table1[[#This Row],[Reason not interested]],Table1[[#This Row],[Reason not enrolled]],Table1[[#This Row],[Reason first service not received]])","v":""}]
[1093,null,"25 to 44 yrs","M","Non-Hispanic/Latino","American Indian or Alaska Native","Yes","Yes","No","Not Employed","0 to 1","MSK","Non-work related","Non-workers comp","Industry 4","Occupation 4","Health provider","Worker’s comp database","County B","Phone",1,1,null,0,"Ineligible reason3",0,null,0,null,0,null,"2019-10-21","2019-11-01","2019-12-07",null,null,{"$f":"IF(Table1[[#This Row],[First service received]]=1,\"Never dropped\",IF(Table1[[#This Row],[Enrolled]]=1,\"No first service\",IF(Table1[[#This Row],[Expressed interest]]=1,\"Not enrolled\",IF(Table1[[#This Row],[Eligible]]=1,\"Not interested\",IF(Table1[[#This Row],[Contacted]]=1,\"Not eligible\",IF(Table1[[#This Row],[Identified]]=1,\"Not contacted\",\"\"))))))","v":"Not eligible"},{"$f":"_xlfn.CONCAT(Table1[[#This Row],[Reason not contacted]],Table1[[#This Row],[Reason not eligible]],Table1[[#This Row],[Reason not interested]],Table1[[#This Row],[Reason not enrolled]],Table1[[#This Row],[Reason first service not received]])","v":"Ineligible reason3"}]
[1107,null,"45 to 64 yrs","M","Non-Hispanic/Latino","White","Yes","Yes","No","Employed","2 to 6","MSK","Work related","Non-workers comp","Industry 3","Occupation 2","Health provider","Clinic appointment schedules","County B","Phone",1,1,null,0,"Ineligible reason3",0,null,0,null,0,null,"2019-10-21","2019-10-30","2019-11-25",null,null,{"$f":"IF(Table1[[#This Row],[First service received]]=1,\"Never dropped\",IF(Table1[[#This Row],[Enrolled]]=1,\"No first service\",IF(Table1[[#This Row],[Expressed interest]]=1,\"Not enrolled\",IF(Table1[[#This Row],[Eligible]]=1,\"Not interested\",IF(Table1[[#This Row],[Contacted]]=1,\"Not eligible\",IF(Table1[[#This Row],[Identified]]=1,\"Not contacted\",\"\"))))))","v":"Not eligible"},{"$f":"_xlfn.CONCAT(Table1[[#This Row],[Reason not contacted]],Table1[[#This Row],[Reason not eligible]],Table1[[#This Row],[Reason not interested]],Table1[[#This Row],[Reason not enrolled]],Table1[[#This Row],[Reason first service not received]])","v":"Ineligible reason3"}]
[1234,null,"25 to 44 yrs","F","Non-Hispanic/Latino","White","Yes","Yes","No","Employed","7 to 12","Cardio or Respiratory","Non-work related","Non-workers comp","Industry 3","Occupation 4","Health provider","Worker’s comp database","County B","Phone",1,1,null,1,null,0,"Not interested reason3",0,null,0,null,"2019-10-21","2019-11-03","2019-11-04",null,null,{"$f":"IF(Table1[[#This Row],[First service received]]=1,\"Never dropped\",IF(Table1[[#This Row],[Enrolled]]=1,\"No first service\",IF(Table1[[#This Row],[Expressed interest]]=1,\"Not enrolled\",IF(Table1[[#This Row],[Eligible]]=1,\"Not interested\",IF(Table1[[#This Row],[Contacted]]=1,\"Not eligible\",IF(Table1[[#This Row],[Identified]]=1,\"Not contacted\",\"\"))))))","v":"Not interested"},{"$f":"_xlfn.CONCAT(Table1[[#This Row],[Reason not contacted]],Table1[[#This Row],[Reason not eligible]],Table1[[#This Row],[Reason not interested]],Table1[[#This Row],[Reason not enrolled]],Table1[[#This Row],[Reason first service not received]])","v":"Not interested reason3"}]
[1303,null,"45 to 64 yrs","M","Non-Hispanic/Latino","White","Yes","Yes","No","Employed","7 to 12","Other","Non-work related","Non-workers comp","Industry 2","Occupation 3","Health provider","Voc rehab centers","County A","Email",1,1,null,0,"Ineligible reason1",0,null,0,null,0,null,"2019-10-21","2019-11-04","2019-12-17",null,null,{"$f":"IF(Table1[[#This Row],[First service received]]=1,\"Never dropped\",IF(Table1[[#This Row],[Enrolled]]=1,\"No first service\",IF(Table1[[#This Row],[Expressed interest]]=1,\"Not enrolled\",IF(Table1[[#This Row],[Eligible]]=1,\"Not interested\",IF(Table1[[#This Row],[Contacted]]=1,\"Not eligible\",IF(Table1[[#This Row],[Identified]]=1,\"Not contacted\",\"\"))))))","v":"Not eligible"},{"$f":"_xlfn.CONCAT(Table1[[#This Row],[Reason not contacted]],Table1[[#This Row],[Reason not eligible]],Table1[[#This Row],[Reason not interested]],Table1[[#This Row],[Reason not enrolled]],Table1[[#This Row],[Reason first service not received]])","v":"Ineligible reason1"}]
[1440,null,"25 to 44 yrs","M","Non-Hispanic/Latino","White","Yes","Yes","No","Employed","7 to 12","Cardio or Respiratory","Work related","Workers comp","Industry 4","Occupation 1","Self","Electronic Health Records","County A","Phone",1,1,null,1,null,1,null,0,"Not enrolled reason1",0,null,"2019-10-21","2019-10-26","2019-11-26",null,null,{"$f":"IF(Table1[[#This Row],[First service received]]=1,\"Never dropped\",IF(Table1[[#This Row],[Enrolled]]=1,\"No first service\",IF(Table1[[#This Row],[Expressed interest]]=1,\"Not enrolled\",IF(Table1[[#This Row],[Eligible]]=1,\"Not interested\",IF(Table1[[#This Row],[Contacted]]=1,\"Not eligible\",IF(Table1[[#This Row],[Identified]]=1,\"Not contacted\",\"\"))))))","v":"Not enrolled"},{"$f":"_xlfn.CONCAT(Table1[[#This Row],[Reason not contacted]],Table1[[#This Row],[Reason not eligible]],Table1[[#This Row],[Reason not interested]],Table1[[#This Row],[Reason not enrolled]],Table1[[#This Row],[Reason first service not received]])","v":"Not enrolled reason1"}]
[1566,null,"25 to 44 yrs","F","Hispanic/Latino","White","No","Yes","No","Employed","13+ weeks","MSK","Work related","Non-workers comp","Industry 3","Occupation 2","Health provider","Worker’s comp database","County B","Other",1,0,"Inaccurate contact info",0,null,0,null,0,null,0,null,"2019-10-21",null,null,null,null,{"$f":"IF(Table1[[#This Row],[First service received]]=1,\"Never dropped\",IF(Table1[[#This Row],[Enrolled]]=1,\"No first service\",IF(Table1[[#This Row],[Expressed interest]]=1,\"Not enrolled\",IF(Table1[[#This Row],[Eligible]]=1,\"Not interested\",IF(Table1[[#This Row],[Contacted]]=1,\"Not eligible\",IF(Table1[[#This Row],[Identified]]=1,\"Not contacted\",\"\"))))))","v":"Not contacted"},{"$f":"_xlfn.CONCAT(Table1[[#This Row],[Reason not contacted]],Table1[[#This Row],[Reason not eligible]],Table1[[#This Row],[Reason not interested]],Table1[[#This Row],[Reason not enrolled]],Table1[[#This Row],[Reason first service not received]])","v":"Inaccurate contact info"}]
[1607,null,"25 to 44 yrs","M","Hispanic/Latino","White","Yes","Yes","No","Employed","2 to 6","Other","Non-work related","Non-workers comp","Industry 3","Occupation 2","Employer","Electronic Health Records","County A","Phone",1,1,null,0,"Ineligible reason1",0,null,0,null,0,null,"2019-10-21","2019-10-24","2019-11-19",null,null,{"$f":"IF(Table1[[#This Row],[First service received]]=1,\"Never dropped\",IF(Table1[[#This Row],[Enrolled]]=1,\"No first service\",IF(Table1[[#This Row],[Expressed interest]]=1,\"Not enrolled\",IF(Table1[[#This Row],[Eligible]]=1,\"Not interested\",IF(Table1[[#This Row],[Contacted]]=1,\"Not eligible\",IF(Table1[[#This Row],[Identified]]=1,\"Not contacted\",\"\"))))))","v":"Not eligible"},{"$f":"_xlfn.CONCAT(Table1[[#This Row],[Reason not contacted]],Table1[[#This Row],[Reason not eligible]],Table1[[#This Row],[Reason not interested]],Table1[[#This Row],[Reason not enrolled]],Table1[[#This Row],[Reason first service not received]])","v":"Ineligible reason1"}]
[1446,null,"18 to 24 yrs","M","Non-Hispanic/Latino","White","No","Yes","No","Employed","7 to 12","Cardio or Respiratory","Non-work related","Non-workers comp","Industry 2","Occupation 3","Self","Electronic Health Records","County A","Phone",1,1,null,1,null,1,null,1,null,0,"No show","2019-10-22","2019-11-03","2019-11-09","2019-11-28",null,{"$f":"IF(Table1[[#This Row],[First service received]]=1,\"Never dropped\",IF(Table1[[#This Row],[Enrolled]]=1,\"No first service\",IF(Table1[[#This Row],[Expressed interest]]=1,\"Not enrolled\",IF(Table1[[#This Row],[Eligible]]=1,\"Not interested\",IF(Table1[[#This Row],[Contacted]]=1,\"Not eligible\",IF(Table1[[#This Row],[Identified]]=1,\"Not contacted\",\"\"))))))","v":"No first service"},{"$f":"_xlfn.CONCAT(Table1[[#This Row],[Reason not contacted]],Table1[[#This Row],[Reason not eligible]],Table1[[#This Row],[Reason not interested]],Table1[[#This Row],[Reason not enrolled]],Table1[[#This Row],[Reason first service not received]])","v":"No show"}]
[1557,null,"25 to 44 yrs","F","Hispanic/Latino","White","No","Yes","No","Employed","7 to 12","MSK","Non-work related","Non-workers comp","Industry 4","Occupation 3","Health provider","Worker’s comp database","County B","In person",1,1,null,1,null,1,null,1,null,1,null,"2019-10-22","2019-10-24","2019-11-04","2019-11-18","2019-11-30",{"$f":"IF(Table1[[#This Row],[First service received]]=1,\"Never dropped\",IF(Table1[[#This Row],[Enrolled]]=1,\"No first service\",IF(Table1[[#This Row],[Expressed interest]]=1,\"Not enrolled\",IF(Table1[[#This Row],[Eligible]]=1,\"Not interested\",IF(Table1[[#This Row],[Contacted]]=1,\"Not eligible\",IF(Table1[[#This Row],[Identified]]=1,\"Not contacted\",\"\"))))))","v":"Never dropped"},{"$f":"_xlfn.CONCAT(Table1[[#This Row],[Reason not contacted]],Table1[[#This Row],[Reason not eligible]],Table1[[#This Row],[Reason not interested]],Table1[[#This Row],[Reason not enrolled]],Table1[[#This Row],[Reason first service not received]])","v":""}]
[1155,null,"25 to 44 yrs","M","Non-Hispanic/Latino","White","No","Yes","No","Not Employed","0 to 1","Other","Non-work related","Non-workers comp","Industry 3","Occupation 1","Health provider","Voc rehab centers","County B","Phone",1,0,"Contacted, no response",0,null,0,null,0,null,0,null,"2019-10-23",null,null,null,null,{"$f":"IF(Table1[[#This Row],[First service received]]=1,\"Never dropped\",IF(Table1[[#This Row],[Enrolled]]=1,\"No first service\",IF(Table1[[#This Row],[Expressed interest]]=1,\"Not enrolled\",IF(Table1[[#This Row],[Eligible]]=1,\"Not interested\",IF(Table1[[#This Row],[Contacted]]=1,\"Not eligible\",IF(Table1[[#This Row],[Identified]]=1,\"Not contacted\",\"\"))))))","v":"Not contacted"},{"$f":"_xlfn.CONCAT(Table1[[#This Row],[Reason not contacted]],Table1[[#This Row],[Reason not eligible]],Table1[[#This Row],[Reason not interested]],Table1[[#This Row],[Reason not enrolled]],Table1[[#This Row],[Reason first service not received]])","v":"Contacted, no response"}]
[1170,null,"25 to 44 yrs","M","Non-Hispanic/Latino","White","No","Yes","No","Employed","2 to 6","MSK","Work related","Workers comp","Industry 2","Occupation 3","Workforce partner","Electronic Health Records","County B","Phone",1,1,null,1,null,0,"Don't want to be in research study",0,null,0,null,"2019-10-23","2019-11-04","2019-11-11",null,null,{"$f":"IF(Table1[[#This Row],[First service received]]=1,\"Never dropped\",IF(Table1[[#This Row],[Enrolled]]=1,\"No first service\",IF(Table1[[#This Row],[Expressed interest]]=1,\"Not enrolled\",IF(Table1[[#This Row],[Eligible]]=1,\"Not interested\",IF(Table1[[#This Row],[Contacted]]=1,\"Not eligible\",IF(Table1[[#This Row],[Identified]]=1,\"Not contacted\",\"\"))))))","v":"Not interested"},{"$f":"_xlfn.CONCAT(Table1[[#This Row],[Reason not contacted]],Table1[[#This Row],[Reason not eligible]],Table1[[#This Row],[Reason not interested]],Table1[[#This Row],[Reason not enrolled]],Table1[[#This Row],[Reason first service not received]])","v":"Don't want to be in research study"}]
[1172,null,"45 to 64 yrs","M","Hispanic/Latino","White","Yes","Yes","No","Employed","7 to 12","Other","Non-work related","Non-workers comp","Industry 1","Occupation 3","Self","Electronic Health Records","County B","Phone",1,0,"Contacted, no response",0,null,0,null,0,null,0,null,"2019-10-23",null,null,null,null,{"$f":"IF(Table1[[#This Row],[First service received]]=1,\"Never dropped\",IF(Table1[[#This Row],[Enrolled]]=1,\"No first service\",IF(Table1[[#This Row],[Expressed interest]]=1,\"Not enrolled\",IF(Table1[[#This Row],[Eligible]]=1,\"Not interested\",IF(Table1[[#This Row],[Contacted]]=1,\"Not eligible\",IF(Table1[[#This Row],[Identified]]=1,\"Not contacted\",\"\"))))))","v":"Not contacted"},{"$f":"_xlfn.CONCAT(Table1[[#This Row],[Reason not contacted]],Table1[[#This Row],[Reason not eligible]],Table1[[#This Row],[Reason not interested]],Table1[[#This Row],[Reason not enrolled]],Table1[[#This Row],[Reason first service not received]])","v":"Contacted, no response"}]
[1329,null,"25 to 44 yrs","F","Non-Hispanic/Latino","White","Yes","No","No","Employed","7 to 12","Other","Non-work related","Non-workers comp","Industry 1","Occupation 3","Health provider","Worker’s comp database","County B","Email",1,1,null,1,null,0,"Don't want to be in research study",0,null,0,null,"2019-10-23","2019-10-26","2019-11-04",null,null,{"$f":"IF(Table1[[#This Row],[First service received]]=1,\"Never dropped\",IF(Table1[[#This Row],[Enrolled]]=1,\"No first service\",IF(Table1[[#This Row],[Expressed interest]]=1,\"Not enrolled\",IF(Table1[[#This Row],[Eligible]]=1,\"Not interested\",IF(Table1[[#This Row],[Contacted]]=1,\"Not eligible\",IF(Table1[[#This Row],[Identified]]=1,\"Not contacted\",\"\"))))))","v":"Not interested"},{"$f":"_xlfn.CONCAT(Table1[[#This Row],[Reason not contacted]],Table1[[#This Row],[Reason not eligible]],Table1[[#This Row],[Reason not interested]],Table1[[#This Row],[Reason not enrolled]],Table1[[#This Row],[Reason first service not received]])","v":"Don't want to be in research study"}]
[1487,null,"65 yrs +","M","Non-Hispanic/Latino","White","Yes","Yes","No","Employed","2 to 6","Cardio or Respiratory","Work related","Workers comp","Industry 3","Occupation 2","Health provider","FMLA forms","County A","Phone",1,1,null,0,"Ineligible reason1",0,null,0,null,0,null,"2019-10-23","2019-10-27","2019-10-30",null,null,{"$f":"IF(Table1[[#This Row],[First service received]]=1,\"Never dropped\",IF(Table1[[#This Row],[Enrolled]]=1,\"No first service\",IF(Table1[[#This Row],[Expressed interest]]=1,\"Not enrolled\",IF(Table1[[#This Row],[Eligible]]=1,\"Not interested\",IF(Table1[[#This Row],[Contacted]]=1,\"Not eligible\",IF(Table1[[#This Row],[Identified]]=1,\"Not contacted\",\"\"))))))","v":"Not eligible"},{"$f":"_xlfn.CONCAT(Table1[[#This Row],[Reason not contacted]],Table1[[#This Row],[Reason not eligible]],Table1[[#This Row],[Reason not interested]],Table1[[#This Row],[Reason not enrolled]],Table1[[#This Row],[Reason first service not received]])","v":"Ineligible reason1"}]
[1497,null,"25 to 44 yrs","M","Hispanic/Latino","White","Yes","Yes","No","Not Employed","0 to 1","MSK","Non-work related","Non-workers comp","Industry 3","Occupation 2","Health provider","Worker’s comp database","County B","Phone",1,1,null,0,"Ineligible reason3",0,null,0,null,0,null,"2019-10-23","2019-11-07","2019-11-14",null,null,{"$f":"IF(Table1[[#This Row],[First service received]]=1,\"Never dropped\",IF(Table1[[#This Row],[Enrolled]]=1,\"No first service\",IF(Table1[[#This Row],[Expressed interest]]=1,\"Not enrolled\",IF(Table1[[#This Row],[Eligible]]=1,\"Not interested\",IF(Table1[[#This Row],[Contacted]]=1,\"Not eligible\",IF(Table1[[#This Row],[Identified]]=1,\"Not contacted\",\"\"))))))","v":"Not eligible"},{"$f":"_xlfn.CONCAT(Table1[[#This Row],[Reason not contacted]],Table1[[#This Row],[Reason not eligible]],Table1[[#This Row],[Reason not interested]],Table1[[#This Row],[Reason not enrolled]],Table1[[#This Row],[Reason first service not received]])","v":"Ineligible reason3"}]
[1522,null,"25 to 44 yrs","F","Non-Hispanic/Latino","White","Yes","Yes","No","Not Employed","0 to 1","Other","Non-work related","Non-workers comp","Industry 2","Occupation 1","Health provider","Clinic appointment schedules","County A","Phone",1,1,null,1,null,1,null,1,null,1,null,"2019-10-23","2019-10-28","2019-11-03","2019-11-23","2019-11-29",{"$f":"IF(Table1[[#This Row],[First service received]]=1,\"Never dropped\",IF(Table1[[#This Row],[Enrolled]]=1,\"No first service\",IF(Table1[[#This Row],[Expressed interest]]=1,\"Not enrolled\",IF(Table1[[#This Row],[Eligible]]=1,\"Not interested\",IF(Table1[[#This Row],[Contacted]]=1,\"Not eligible\",IF(Table1[[#This Row],[Identified]]=1,\"Not contacted\",\"\"))))))","v":"Never dropped"},{"$f":"_xlfn.CONCAT(Table1[[#This Row],[Reason not contacted]],Table1[[#This Row],[Reason not eligible]],Table1[[#This Row],[Reason not interested]],Table1[[#This Row],[Reason not enrolled]],Table1[[#This Row],[Reason first service not received]])","v":""}]
[1117,null,"25 to 44 yrs","M","Non-Hispanic/Latino","Hawaiian or Pacific Islander","Yes","Yes","No","Employed","0 to 1","Cardio or Respiratory","Non-work related","Non-workers comp","Industry 3","Occupation 2","Health provider","Work restriction forms","County B","Email",1,1,null,1,null,1,null,1,null,1,null,"2019-10-24","2019-10-30","2019-11-04","2019-11-15","2019-11-20",{"$f":"IF(Table1[[#This Row],[First service received]]=1,\"Never dropped\",IF(Table1[[#This Row],[Enrolled]]=1,\"No first service\",IF(Table1[[#This Row],[Expressed interest]]=1,\"Not enrolled\",IF(Table1[[#This Row],[Eligible]]=1,\"Not interested\",IF(Table1[[#This Row],[Contacted]]=1,\"Not eligible\",IF(Table1[[#This Row],[Identified]]=1,\"Not contacted\",\"\"))))))","v":"Never dropped"},{"$f":"_xlfn.CONCAT(Table1[[#This Row],[Reason not contacted]],Table1[[#This Row],[Reason not eligible]],Table1[[#This Row],[Reason not interested]],Table1[[#This Row],[Reason not enrolled]],Table1[[#This Row],[Reason first service not received]])","v":""}]
[1353,null,"45 to 64 yrs","F","Non-Hispanic/Latino","White","No","Yes","No","Employed","2 to 6","Other","Non-work related","Non-workers comp","Industry 3","Occupation 2","Employer","Electronic Health Records","County A","Phone",1,1,null,0,"Ineligible reason2",0,null,0,null,0,null,"2019-10-24","2019-11-08","2019-11-11",null,null,{"$f":"IF(Table1[[#This Row],[First service received]]=1,\"Never dropped\",IF(Table1[[#This Row],[Enrolled]]=1,\"No first service\",IF(Table1[[#This Row],[Expressed interest]]=1,\"Not enrolled\",IF(Table1[[#This Row],[Eligible]]=1,\"Not interested\",IF(Table1[[#This Row],[Contacted]]=1,\"Not eligible\",IF(Table1[[#This Row],[Identified]]=1,\"Not contacted\",\"\"))))))","v":"Not eligible"},{"$f":"_xlfn.CONCAT(Table1[[#This Row],[Reason not contacted]],Table1[[#This Row],[Reason not eligible]],Table1[[#This Row],[Reason not interested]],Table1[[#This Row],[Reason not enrolled]],Table1[[#This Row],[Reason first service not received]])","v":"Ineligible reason2"}]
[1519,null,"25 to 44 yrs","F","Non-Hispanic/Latino","White","No","Yes","No","Employed","2 to 6","MSK","Non-work related","Non-workers comp","Industry 1","Occupation 3","Health provider","Work restriction forms","County B","Email",1,1,null,0,"Ineligible reason1",0,null,0,null,0,null,"2019-10-24","2019-11-03","2019-12-12",null,null,{"$f":"IF(Table1[[#This Row],[First service received]]=1,\"Never dropped\",IF(Table1[[#This Row],[Enrolled]]=1,\"No first service\",IF(Table1[[#This Row],[Expressed interest]]=1,\"Not enrolled\",IF(Table1[[#This Row],[Eligible]]=1,\"Not interested\",IF(Table1[[#This Row],[Contacted]]=1,\"Not eligible\",IF(Table1[[#This Row],[Identified]]=1,\"Not contacted\",\"\"))))))","v":"Not eligible"},{"$f":"_xlfn.CONCAT(Table1[[#This Row],[Reason not contacted]],Table1[[#This Row],[Reason not eligible]],Table1[[#This Row],[Reason not interested]],Table1[[#This Row],[Reason not enrolled]],Table1[[#This Row],[Reason first service not received]])","v":"Ineligible reason1"}]
[1573,null,"25 to 44 yrs","M","Non-Hispanic/Latino","Black or African-American","Yes","Yes","No","Employed","7 to 12","Other","Non-work related","Non-workers comp","Industry 1","Occupation 1","Employer","Electronic Health Records","County B","Phone",1,1,null,1,null,1,null,1,null,1,null,"2019-10-24","2019-10-27","2019-11-04","2019-11-13","2019-11-18",{"$f":"IF(Table1[[#This Row],[First service received]]=1,\"Never dropped\",IF(Table1[[#This Row],[Enrolled]]=1,\"No first service\",IF(Table1[[#This Row],[Expressed interest]]=1,\"Not enrolled\",IF(Table1[[#This Row],[Eligible]]=1,\"Not interested\",IF(Table1[[#This Row],[Contacted]]=1,\"Not eligible\",IF(Table1[[#This Row],[Identified]]=1,\"Not contacted\",\"\"))))))","v":"Never dropped"},{"$f":"_xlfn.CONCAT(Table1[[#This Row],[Reason not contacted]],Table1[[#This Row],[Reason not eligible]],Table1[[#This Row],[Reason not interested]],Table1[[#This Row],[Reason not enrolled]],Table1[[#This Row],[Reason first service not received]])","v":""}]
[1083,null,"18 to 24 yrs","F","Non-Hispanic/Latino","American Indian or Alaska Native","Yes","Yes","No","Employed","7 to 12","MSK","Non-work related","Non-workers comp","Industry 3","Occupation 2","Workforce partner","Electronic Health Records","County B","In person",1,1,null,0,"Ineligible reason3",0,null,0,null,0,null,"2019-10-25","2019-11-04","2019-12-10",null,null,{"$f":"IF(Table1[[#This Row],[First service received]]=1,\"Never dropped\",IF(Table1[[#This Row],[Enrolled]]=1,\"No first service\",IF(Table1[[#This Row],[Expressed interest]]=1,\"Not enrolled\",IF(Table1[[#This Row],[Eligible]]=1,\"Not interested\",IF(Table1[[#This Row],[Contacted]]=1,\"Not eligible\",IF(Table1[[#This Row],[Identified]]=1,\"Not contacted\",\"\"))))))","v":"Not eligible"},{"$f":"_xlfn.CONCAT(Table1[[#This Row],[Reason not contacted]],Table1[[#This Row],[Reason not eligible]],Table1[[#This Row],[Reason not interested]],Table1[[#This Row],[Reason not enrolled]],Table1[[#This Row],[Reason first service not received]])","v":"Ineligible reason3"}]
[1102,null,"45 to 64 yrs","F","Non-Hispanic/Latino","White","Yes","Yes","No","Employed","2 to 6","MSK","Non-work related","Non-workers comp","Industry 3","Occupation 2","Health provider","Clinic appointment schedules","County B","In person",1,1,null,1,null,0,"Don't want to be in research study",0,null,0,null,"2019-10-25","2019-11-05","2019-12-18",null,null,{"$f":"IF(Table1[[#This Row],[First service received]]=1,\"Never dropped\",IF(Table1[[#This Row],[Enrolled]]=1,\"No first service\",IF(Table1[[#This Row],[Expressed interest]]=1,\"Not enrolled\",IF(Table1[[#This Row],[Eligible]]=1,\"Not interested\",IF(Table1[[#This Row],[Contacted]]=1,\"Not eligible\",IF(Table1[[#This Row],[Identified]]=1,\"Not contacted\",\"\"))))))","v":"Not interested"},{"$f":"_xlfn.CONCAT(Table1[[#This Row],[Reason not contacted]],Table1[[#This Row],[Reason not eligible]],Table1[[#This Row],[Reason not interested]],Table1[[#This Row],[Reason not enrolled]],Table1[[#This Row],[Reason first service not received]])","v":"Don't want to be in research study"}]
[1284,null,"45 to 64 yrs","M","Non-Hispanic/Latino","White","Yes","Yes","No","Employed","2 to 6","MSK","Non-work related","Non-workers comp","Industry 1","Occupation 4","Workforce partner","Electronic Health Records","County C","In person",1,1,null,1,null,1,null,1,null,0,"No show","2019-10-25","2019-11-04","2019-11-10","2019-11-28",null,{"$f":"IF(Table1[[#This Row],[First service received]]=1,\"Never dropped\",IF(Table1[[#This Row],[Enrolled]]=1,\"No first service\",IF(Table1[[#This Row],[Expressed interest]]=1,\"Not enrolled\",IF(Table1[[#This Row],[Eligible]]=1,\"Not interested\",IF(Table1[[#This Row],[Contacted]]=1,\"Not eligible\",IF(Table1[[#This Row],[Identified]]=1,\"Not contacted\",\"\"))))))","v":"No first service"},{"$f":"_xlfn.CONCAT(Table1[[#This Row],[Reason not contacted]],Table1[[#This Row],[Reason not eligible]],Table1[[#This Row],[Reason not interested]],Table1[[#This Row],[Reason not enrolled]],Table1[[#This Row],[Reason first service not received]])","v":"No show"}]
[1577,null,"25 to 44 yrs","F","Hispanic/Latino","White","No","Yes","No","Employed","7 to 12","MSK","Non-work related","Non-workers comp","Industry 4","Occupation 3","Health provider","Worker’s comp database","County B","Email",1,0,"No contact info",0,null,0,null,0,null,0,null,"2019-10-25",null,null,null,null,{"$f":"IF(Table1[[#This Row],[First service received]]=1,\"Never dropped\",IF(Table1[[#This Row],[Enrolled]]=1,\"No first service\",IF(Table1[[#This Row],[Expressed interest]]=1,\"Not enrolled\",IF(Table1[[#This Row],[Eligible]]=1,\"Not interested\",IF(Table1[[#This Row],[Contacted]]=1,\"Not eligible\",IF(Table1[[#This Row],[Identified]]=1,\"Not contacted\",\"\"))))))","v":"Not contacted"},{"$f":"_xlfn.CONCAT(Table1[[#This Row],[Reason not contacted]],Table1[[#This Row],[Reason not eligible]],Table1[[#This Row],[Reason not interested]],Table1[[#This Row],[Reason not enrolled]],Table1[[#This Row],[Reason first service not received]])","v":"No contact info"}]
[1622,null,"45 to 64 yrs","M","Non-Hispanic/Latino","White","Yes","Yes","No","Employed","7 to 12","MSK","Non-work related","Non-workers comp","Industry 3","Occupation 2","Employer","Electronic Health Records","County B","Phone",1,1,null,0,"Ineligible reason1",0,null,0,null,0,null,"2019-10-25","2019-11-03","2019-12-07",null,null,{"$f":"IF(Table1[[#This Row],[First service received]]=1,\"Never dropped\",IF(Table1[[#This Row],[Enrolled]]=1,\"No first service\",IF(Table1[[#This Row],[Expressed interest]]=1,\"Not enrolled\",IF(Table1[[#This Row],[Eligible]]=1,\"Not interested\",IF(Table1[[#This Row],[Contacted]]=1,\"Not eligible\",IF(Table1[[#This Row],[Identified]]=1,\"Not contacted\",\"\"))))))","v":"Not eligible"},{"$f":"_xlfn.CONCAT(Table1[[#This Row],[Reason not contacted]],Table1[[#This Row],[Reason not eligible]],Table1[[#This Row],[Reason not interested]],Table1[[#This Row],[Reason not enrolled]],Table1[[#This Row],[Reason first service not received]])","v":"Ineligible reason1"}]
[1059,null,"25 to 44 yrs","F","Hispanic/Latino","White","Yes","Yes","Yes","Employed","2 to 6","MSK","Non-work related","Non-workers comp","Industry 3","Occupation 3","Health provider","Worker’s comp database","County B","Phone",1,1,null,1,null,0,"Impact on provider relationship",0,null,0,null,"2019-10-26","2019-10-30","2019-11-24",null,null,{"$f":"IF(Table1[[#This Row],[First service received]]=1,\"Never dropped\",IF(Table1[[#This Row],[Enrolled]]=1,\"No first service\",IF(Table1[[#This Row],[Expressed interest]]=1,\"Not enrolled\",IF(Table1[[#This Row],[Eligible]]=1,\"Not interested\",IF(Table1[[#This Row],[Contacted]]=1,\"Not eligible\",IF(Table1[[#This Row],[Identified]]=1,\"Not contacted\",\"\"))))))","v":"Not interested"},{"$f":"_xlfn.CONCAT(Table1[[#This Row],[Reason not contacted]],Table1[[#This Row],[Reason not eligible]],Table1[[#This Row],[Reason not interested]],Table1[[#This Row],[Reason not enrolled]],Table1[[#This Row],[Reason first service not received]])","v":"Impact on provider relationship"}]
[1129,null,"25 to 44 yrs","M","Non-Hispanic/Latino","White","Yes","Yes","Yes","Employed","0 to 1","Cardio or Respiratory","Work related","Workers comp","Industry 1","Occupation 3","Self","Electronic Health Records","County A","Other",1,0,"Inaccurate contact info",0,null,0,null,0,null,0,null,"2019-10-26",null,null,null,null,{"$f":"IF(Table1[[#This Row],[First service received]]=1,\"Never dropped\",IF(Table1[[#This Row],[Enrolled]]=1,\"No first service\",IF(Table1[[#This Row],[Expressed interest]]=1,\"Not enrolled\",IF(Table1[[#This Row],[Eligible]]=1,\"Not interested\",IF(Table1[[#This Row],[Contacted]]=1,\"Not eligible\",IF(Table1[[#This Row],[Identified]]=1,\"Not contacted\",\"\"))))))","v":"Not contacted"},{"$f":"_xlfn.CONCAT(Table1[[#This Row],[Reason not contacted]],Table1[[#This Row],[Reason not eligible]],Table1[[#This Row],[Reason not interested]],Table1[[#This Row],[Reason not enrolled]],Table1[[#This Row],[Reason first service not received]])","v":"Inaccurate contact info"}]
[1211,null,"45 to 64 yrs","M","Non-Hispanic/Latino","Black or African-American","Yes","No","No","Employed","7 to 12","MSK","Non-work related","Non-workers comp","Industry 1","Occupation 1","Health provider","Work restriction forms","County B","Email",1,0,"Contacted, no response",0,null,0,null,0,null,0,null,"2019-10-26",null,null,null,null,{"$f":"IF(Table1[[#This Row],[First service received]]=1,\"Never dropped\",IF(Table1[[#This Row],[Enrolled]]=1,\"No first service\",IF(Table1[[#This Row],[Expressed interest]]=1,\"Not enrolled\",IF(Table1[[#This Row],[Eligible]]=1,\"Not interested\",IF(Table1[[#This Row],[Contacted]]=1,\"Not eligible\",IF(Table1[[#This Row],[Identified]]=1,\"Not contacted\",\"\"))))))","v":"Not contacted"},{"$f":"_xlfn.CONCAT(Table1[[#This Row],[Reason not contacted]],Table1[[#This Row],[Reason not eligible]],Table1[[#This Row],[Reason not interested]],Table1[[#This Row],[Reason not enrolled]],Table1[[#This Row],[Reason first service not received]])","v":"Contacted, no response"}]
[1212,null,"25 to 44 yrs","M","Non-Hispanic/Latino","White","Yes","Yes","No","Not Employed","0 to 1","MSK","Non-work related","Non-workers comp","Industry 3","Occupation 2","Self","Electronic Health Records","County C","Phone",1,1,null,0,"Ineligible reason1",0,null,0,null,0,null,"2019-10-26","2019-10-27","2019-12-04",null,null,{"$f":"IF(Table1[[#This Row],[First service received]]=1,\"Never dropped\",IF(Table1[[#This Row],[Enrolled]]=1,\"No first service\",IF(Table1[[#This Row],[Expressed interest]]=1,\"Not enrolled\",IF(Table1[[#This Row],[Eligible]]=1,\"Not interested\",IF(Table1[[#This Row],[Contacted]]=1,\"Not eligible\",IF(Table1[[#This Row],[Identified]]=1,\"Not contacted\",\"\"))))))","v":"Not eligible"},{"$f":"_xlfn.CONCAT(Table1[[#This Row],[Reason not contacted]],Table1[[#This Row],[Reason not eligible]],Table1[[#This Row],[Reason not interested]],Table1[[#This Row],[Reason not enrolled]],Table1[[#This Row],[Reason first service not received]])","v":"Ineligible reason1"}]
[1376,null,"25 to 44 yrs","M","Non-Hispanic/Latino","White","Yes","Yes","No","Employed","13+ weeks","Other","Non-work related","Non-workers comp","Industry 2","Occupation 1","Health provider","Work restriction forms","County A","Phone",1,1,null,0,"Ineligible reason3",0,null,0,null,0,null,"2019-10-26","2019-11-08","2019-11-13",null,null,{"$f":"IF(Table1[[#This Row],[First service received]]=1,\"Never dropped\",IF(Table1[[#This Row],[Enrolled]]=1,\"No first service\",IF(Table1[[#This Row],[Expressed interest]]=1,\"Not enrolled\",IF(Table1[[#This Row],[Eligible]]=1,\"Not interested\",IF(Table1[[#This Row],[Contacted]]=1,\"Not eligible\",IF(Table1[[#This Row],[Identified]]=1,\"Not contacted\",\"\"))))))","v":"Not eligible"},{"$f":"_xlfn.CONCAT(Table1[[#This Row],[Reason not contacted]],Table1[[#This Row],[Reason not eligible]],Table1[[#This Row],[Reason not interested]],Table1[[#This Row],[Reason not enrolled]],Table1[[#This Row],[Reason first service not received]])","v":"Ineligible reason3"}]
[1458,null,"45 to 64 yrs","M","Non-Hispanic/Latino","White","Yes","Yes","No","Employed","2 to 6","MSK","Work related","Non-workers comp","Industry 2","Occupation 4","Workforce partner","Electronic Health Records","County B","Email",1,1,null,0,"Ineligible reason3",0,null,0,null,0,null,"2019-10-26","2019-11-07","2019-11-21",null,null,{"$f":"IF(Table1[[#This Row],[First service received]]=1,\"Never dropped\",IF(Table1[[#This Row],[Enrolled]]=1,\"No first service\",IF(Table1[[#This Row],[Expressed interest]]=1,\"Not enrolled\",IF(Table1[[#This Row],[Eligible]]=1,\"Not interested\",IF(Table1[[#This Row],[Contacted]]=1,\"Not eligible\",IF(Table1[[#This Row],[Identified]]=1,\"Not contacted\",\"\"))))))","v":"Not eligible"},{"$f":"_xlfn.CONCAT(Table1[[#This Row],[Reason not contacted]],Table1[[#This Row],[Reason not eligible]],Table1[[#This Row],[Reason not interested]],Table1[[#This Row],[Reason not enrolled]],Table1[[#This Row],[Reason first service not received]])","v":"Ineligible reason3"}]
[1555,null,"45 to 64 yrs","F","Non-Hispanic/Latino","White","Yes","Yes","No","Employed","2 to 6","MSK","Non-work related","Non-workers comp","Industry 1","Occupation 1","Self","Electronic Health Records","County B","In person",1,1,null,1,null,1,null,1,null,1,null,"2019-10-26","2019-11-04","2019-11-10","2019-11-30","2019-12-13",{"$f":"IF(Table1[[#This Row],[First service received]]=1,\"Never dropped\",IF(Table1[[#This Row],[Enrolled]]=1,\"No first service\",IF(Table1[[#This Row],[Expressed interest]]=1,\"Not enrolled\",IF(Table1[[#This Row],[Eligible]]=1,\"Not interested\",IF(Table1[[#This Row],[Contacted]]=1,\"Not eligible\",IF(Table1[[#This Row],[Identified]]=1,\"Not contacted\",\"\"))))))","v":"Never dropped"},{"$f":"_xlfn.CONCAT(Table1[[#This Row],[Reason not contacted]],Table1[[#This Row],[Reason not eligible]],Table1[[#This Row],[Reason not interested]],Table1[[#This Row],[Reason not enrolled]],Table1[[#This Row],[Reason first service not received]])","v":""}]
[1024,null,"45 to 64 yrs","F","Hispanic/Latino","White","No","Yes","Yes","Not Employed","0 to 1","Other","Non-work related","Non-workers comp","Industry 1","Occupation 4","Health provider","Worker’s comp database","County A","Phone",1,0,"Contacted, no response",0,null,0,null,0,null,0,null,"2019-10-27",null,null,null,null,{"$f":"IF(Table1[[#This Row],[First service received]]=1,\"Never dropped\",IF(Table1[[#This Row],[Enrolled]]=1,\"No first service\",IF(Table1[[#This Row],[Expressed interest]]=1,\"Not enrolled\",IF(Table1[[#This Row],[Eligible]]=1,\"Not interested\",IF(Table1[[#This Row],[Contacted]]=1,\"Not eligible\",IF(Table1[[#This Row],[Identified]]=1,\"Not contacted\",\"\"))))))","v":"Not contacted"},{"$f":"_xlfn.CONCAT(Table1[[#This Row],[Reason not contacted]],Table1[[#This Row],[Reason not eligible]],Table1[[#This Row],[Reason not interested]],Table1[[#This Row],[Reason not enrolled]],Table1[[#This Row],[Reason first service not received]])","v":"Contacted, no response"}]
[1099,null,"45 to 64 yrs","M","Non-Hispanic/Latino","White","Yes","Yes","No","Employed","2 to 6","MSK","Non-work related","Non-workers comp","Industry 1","Occupation 4","Health provider","Clinic appointment schedules","County A","Phone",1,0,"No contact info",0,null,0,null,0,null,0,null,"2019-10-27",null,null,null,null,{"$f":"IF(Table1[[#This Row],[First service received]]=1,\"Never dropped\",IF(Table1[[#This Row],[Enrolled]]=1,\"No first service\",IF(Table1[[#This Row],[Expressed interest]]=1,\"Not enrolled\",IF(Table1[[#This Row],[Eligible]]=1,\"Not interested\",IF(Table1[[#This Row],[Contacted]]=1,\"Not eligible\",IF(Table1[[#This Row],[Identified]]=1,\"Not contacted\",\"\"))))))","v":"Not contacted"},{"$f":"_xlfn.CONCAT(Table1[[#This Row],[Reason not contacted]],Table1[[#This Row],[Reason not eligible]],Table1[[#This Row],[Reason not interested]],Table1[[#This Row],[Reason not enrolled]],Table1[[#This Row],[Reason first service not received]])","v":"No contact info"}]
[1319,null,"25 to 44 yrs","F","Non-Hispanic/Latino","White","No","Yes","No","Employed","2 to 6","MSK","Non-work related","Non-workers comp","Industry 3","Occupation 2","Health provider","Work restriction forms","County B","Phone",1,0,"No contact info",0,null,0,null,0,null,0,null,"2019-10-27",null,null,null,null,{"$f":"IF(Table1[[#This Row],[First service received]]=1,\"Never dropped\",IF(Table1[[#This Row],[Enrolled]]=1,\"No first service\",IF(Table1[[#This Row],[Expressed interest]]=1,\"Not enrolled\",IF(Table1[[#This Row],[Eligible]]=1,\"Not interested\",IF(Table1[[#This Row],[Contacted]]=1,\"Not eligible\",IF(Table1[[#This Row],[Identified]]=1,\"Not contacted\",\"\"))))))","v":"Not contacted"},{"$f":"_xlfn.CONCAT(Table1[[#This Row],[Reason not contacted]],Table1[[#This Row],[Reason not eligible]],Table1[[#This Row],[Reason not interested]],Table1[[#This Row],[Reason not enrolled]],Table1[[#This Row],[Reason first service not received]])","v":"No contact info"}]
[1371,null,"25 to 44 yrs","M","Non-Hispanic/Latino","Black or African-American","Yes","Yes","No","Employed","7 to 12","MSK","Non-work related","Non-workers comp","Industry 2","Occupation 3","Health provider","Clinic appointment schedules","County B","In person",1,1,null,1,null,1,null,1,null,0,"Returned to work","2019-10-27","2019-10-31","2019-11-04","2019-11-28",null,{"$f":"IF(Table1[[#This Row],[First service received]]=1,\"Never dropped\",IF(Table1[[#This Row],[Enrolled]]=1,\"No first service\",IF(Table1[[#This Row],[Expressed interest]]=1,\"Not enrolled\",IF(Table1[[#This Row],[Eligible]]=1,\"Not interested\",IF(Table1[[#This Row],[Contacted]]=1,\"Not eligible\",IF(Table1[[#This Row],[Identified]]=1,\"Not contacted\",\"\"))))))","v":"No first service"},{"$f":"_xlfn.CONCAT(Table1[[#This Row],[Reason not contacted]],Table1[[#This Row],[Reason not eligible]],Table1[[#This Row],[Reason not interested]],Table1[[#This Row],[Reason not enrolled]],Table1[[#This Row],[Reason first service not received]])","v":"Returned to work"}]
[1391,null,"18 to 24 yrs","F","Non-Hispanic/Latino","White","Yes","Yes","No","Employed","0 to 1","Cardio or Respiratory","Non-work related","Non-workers comp","Industry 3","Occupation 2","Self","Electronic Health Records","County C","Phone",1,1,null,1,null,0,"Impact on provider relationship",0,null,0,null,"2019-10-27","2019-11-09","2019-11-20",null,null,{"$f":"IF(Table1[[#This Row],[First service received]]=1,\"Never dropped\",IF(Table1[[#This Row],[Enrolled]]=1,\"No first service\",IF(Table1[[#This Row],[Expressed interest]]=1,\"Not enrolled\",IF(Table1[[#This Row],[Eligible]]=1,\"Not interested\",IF(Table1[[#This Row],[Contacted]]=1,\"Not eligible\",IF(Table1[[#This Row],[Identified]]=1,\"Not contacted\",\"\"))))))","v":"Not interested"},{"$f":"_xlfn.CONCAT(Table1[[#This Row],[Reason not contacted]],Table1[[#This Row],[Reason not eligible]],Table1[[#This Row],[Reason not interested]],Table1[[#This Row],[Reason not enrolled]],Table1[[#This Row],[Reason first service not received]])","v":"Impact on provider relationship"}]
[1428,null,"18 to 24 yrs","F","Non-Hispanic/Latino","Black or African-American","Yes","Yes","No","Employed","0 to 1","MSK","Work related","Non-workers comp","Industry 3","Occupation 2","Health provider","Worker’s comp database","County B","In person",1,1,null,1,null,1,null,1,null,1,null,"2019-10-27","2019-10-31","2019-11-06","2019-11-21","2019-12-03",{"$f":"IF(Table1[[#This Row],[First service received]]=1,\"Never dropped\",IF(Table1[[#This Row],[Enrolled]]=1,\"No first service\",IF(Table1[[#This Row],[Expressed interest]]=1,\"Not enrolled\",IF(Table1[[#This Row],[Eligible]]=1,\"Not interested\",IF(Table1[[#This Row],[Contacted]]=1,\"Not eligible\",IF(Table1[[#This Row],[Identified]]=1,\"Not contacted\",\"\"))))))","v":"Never dropped"},{"$f":"_xlfn.CONCAT(Table1[[#This Row],[Reason not contacted]],Table1[[#This Row],[Reason not eligible]],Table1[[#This Row],[Reason not interested]],Table1[[#This Row],[Reason not enrolled]],Table1[[#This Row],[Reason first service not received]])","v":""}]
[1459,null,"25 to 44 yrs","F","Non-Hispanic/Latino","White","Yes","Yes","No","Not Employed","0 to 1","MSK","Non-work related","Non-workers comp","Industry 4","Occupation 4","Health provider","Worker’s comp database","County A","Phone",1,1,null,0,"Ineligible reason3",0,null,0,null,0,null,"2019-10-27","2019-11-05","2019-12-15",null,null,{"$f":"IF(Table1[[#This Row],[First service received]]=1,\"Never dropped\",IF(Table1[[#This Row],[Enrolled]]=1,\"No first service\",IF(Table1[[#This Row],[Expressed interest]]=1,\"Not enrolled\",IF(Table1[[#This Row],[Eligible]]=1,\"Not interested\",IF(Table1[[#This Row],[Contacted]]=1,\"Not eligible\",IF(Table1[[#This Row],[Identified]]=1,\"Not contacted\",\"\"))))))","v":"Not eligible"},{"$f":"_xlfn.CONCAT(Table1[[#This Row],[Reason not contacted]],Table1[[#This Row],[Reason not eligible]],Table1[[#This Row],[Reason not interested]],Table1[[#This Row],[Reason not enrolled]],Table1[[#This Row],[Reason first service not received]])","v":"Ineligible reason3"}]
[1513,null,"45 to 64 yrs","F","Non-Hispanic/Latino","White","Yes","Yes","No","Employed","2 to 6","MSK","Non-work related","Non-workers comp","Industry 3","Occupation 2","Health provider","Clinic appointment schedules","County A","Phone",1,1,null,0,"Ineligible reason1",0,null,0,null,0,null,"2019-10-27","2019-10-28","2019-10-29",null,null,{"$f":"IF(Table1[[#This Row],[First service received]]=1,\"Never dropped\",IF(Table1[[#This Row],[Enrolled]]=1,\"No first service\",IF(Table1[[#This Row],[Expressed interest]]=1,\"Not enrolled\",IF(Table1[[#This Row],[Eligible]]=1,\"Not interested\",IF(Table1[[#This Row],[Contacted]]=1,\"Not eligible\",IF(Table1[[#This Row],[Identified]]=1,\"Not contacted\",\"\"))))))","v":"Not eligible"},{"$f":"_xlfn.CONCAT(Table1[[#This Row],[Reason not contacted]],Table1[[#This Row],[Reason not eligible]],Table1[[#This Row],[Reason not interested]],Table1[[#This Row],[Reason not enrolled]],Table1[[#This Row],[Reason first service not received]])","v":"Ineligible reason1"}]
[1518,null,"45 to 64 yrs","F","Non-Hispanic/Latino","White","Yes","Yes","No","Not Employed","0 to 1","MSK","Non-work related","Non-workers comp","Industry 1","Occupation 3","Health provider","Worker’s comp database","County B","Phone",1,1,null,0,"Ineligible reason3",0,null,0,null,0,null,"2019-10-27","2019-11-09","2019-12-10",null,null,{"$f":"IF(Table1[[#This Row],[First service received]]=1,\"Never dropped\",IF(Table1[[#This Row],[Enrolled]]=1,\"No first service\",IF(Table1[[#This Row],[Expressed interest]]=1,\"Not enrolled\",IF(Table1[[#This Row],[Eligible]]=1,\"Not interested\",IF(Table1[[#This Row],[Contacted]]=1,\"Not eligible\",IF(Table1[[#This Row],[Identified]]=1,\"Not contacted\",\"\"))))))","v":"Not eligible"},{"$f":"_xlfn.CONCAT(Table1[[#This Row],[Reason not contacted]],Table1[[#This Row],[Reason not eligible]],Table1[[#This Row],[Reason not interested]],Table1[[#This Row],[Reason not enrolled]],Table1[[#This Row],[Reason first service not received]])","v":"Ineligible reason3"}]
[1104,null,"25 to 44 yrs","F","Hispanic/Latino","White","Yes","No","Yes","Not Employed","0 to 1","MSK","Non-work related","Non-workers comp","Industry 2","Occupation 3","Health provider","Worker’s comp database","County B","Phone",1,1,null,1,null,0,"Don't want to be in research study",0,null,0,null,"2019-10-28","2019-10-31","2019-11-21",null,null,{"$f":"IF(Table1[[#This Row],[First service received]]=1,\"Never dropped\",IF(Table1[[#This Row],[Enrolled]]=1,\"No first service\",IF(Table1[[#This Row],[Expressed interest]]=1,\"Not enrolled\",IF(Table1[[#This Row],[Eligible]]=1,\"Not interested\",IF(Table1[[#This Row],[Contacted]]=1,\"Not eligible\",IF(Table1[[#This Row],[Identified]]=1,\"Not contacted\",\"\"))))))","v":"Not interested"},{"$f":"_xlfn.CONCAT(Table1[[#This Row],[Reason not contacted]],Table1[[#This Row],[Reason not eligible]],Table1[[#This Row],[Reason not interested]],Table1[[#This Row],[Reason not enrolled]],Table1[[#This Row],[Reason first service not received]])","v":"Don't want to be in research study"}]
[1180,null,"25 to 44 yrs","F","Hispanic/Latino","White","Yes","Yes","No","Not Employed","0 to 1","MSK","Non-work related","Non-workers comp","Industry 1","Occupation 3","Health provider","Work restriction forms","County B","Phone",1,1,null,1,null,0,"Impact on provider relationship",0,null,0,null,"2019-10-28","2019-11-10","2019-12-06",null,null,{"$f":"IF(Table1[[#This Row],[First service received]]=1,\"Never dropped\",IF(Table1[[#This Row],[Enrolled]]=1,\"No first service\",IF(Table1[[#This Row],[Expressed interest]]=1,\"Not enrolled\",IF(Table1[[#This Row],[Eligible]]=1,\"Not interested\",IF(Table1[[#This Row],[Contacted]]=1,\"Not eligible\",IF(Table1[[#This Row],[Identified]]=1,\"Not contacted\",\"\"))))))","v":"Not interested"},{"$f":"_xlfn.CONCAT(Table1[[#This Row],[Reason not contacted]],Table1[[#This Row],[Reason not eligible]],Table1[[#This Row],[Reason not interested]],Table1[[#This Row],[Reason not enrolled]],Table1[[#This Row],[Reason first service not received]])","v":"Impact on provider relationship"}]
[1228,null,"25 to 44 yrs","F","Non-Hispanic/Latino","Other or 2 or more","Yes","No","No","Not Employed","0 to 1","MSK","Non-work related","Non-workers comp","Industry 3","Occupation 2","Health provider","Work restriction forms","County C","Phone",1,1,null,1,null,1,null,1,null,1,null,"2019-10-28","2019-11-06","2019-11-16","2019-12-04","2019-12-05",{"$f":"IF(Table1[[#This Row],[First service received]]=1,\"Never dropped\",IF(Table1[[#This Row],[Enrolled]]=1,\"No first service\",IF(Table1[[#This Row],[Expressed interest]]=1,\"Not enrolled\",IF(Table1[[#This Row],[Eligible]]=1,\"Not interested\",IF(Table1[[#This Row],[Contacted]]=1,\"Not eligible\",IF(Table1[[#This Row],[Identified]]=1,\"Not contacted\",\"\"))))))","v":"Never dropped"},{"$f":"_xlfn.CONCAT(Table1[[#This Row],[Reason not contacted]],Table1[[#This Row],[Reason not eligible]],Table1[[#This Row],[Reason not interested]],Table1[[#This Row],[Reason not enrolled]],Table1[[#This Row],[Reason first service not received]])","v":""}]
[1281,null,"45 to 64 yrs","F","Non-Hispanic/Latino","Black or African-American","Yes","Yes","No","Self-employed","13+ weeks","MSK","Work related","Workers comp","Industry 3","Occupation 1","Employer","Electronic Health Records","County B","Phone",1,1,null,1,null,1,null,1,null,1,null,"2019-10-28","2019-11-01","2019-11-08","2019-11-26","2019-12-02",{"$f":"IF(Table1[[#This Row],[First service received]]=1,\"Never dropped\",IF(Table1[[#This Row],[Enrolled]]=1,\"No first service\",IF(Table1[[#This Row],[Expressed interest]]=1,\"Not enrolled\",IF(Table1[[#This Row],[Eligible]]=1,\"Not interested\",IF(Table1[[#This Row],[Contacted]]=1,\"Not eligible\",IF(Table1[[#This Row],[Identified]]=1,\"Not contacted\",\"\"))))))","v":"Never dropped"},{"$f":"_xlfn.CONCAT(Table1[[#This Row],[Reason not contacted]],Table1[[#This Row],[Reason not eligible]],Table1[[#This Row],[Reason not interested]],Table1[[#This Row],[Reason not enrolled]],Table1[[#This Row],[Reason first service not received]])","v":""}]
[1463,null,"25 to 44 yrs","M","Non-Hispanic/Latino","White","Yes","Yes","No","Employed","0 to 1","Other","Work related","Workers comp","Industry 1","Occupation 3","Health provider","Worker’s comp database","County A","Phone",1,1,null,0,"Ineligible reason1",0,null,0,null,0,null,"2019-10-28","2019-11-11","2019-11-25",null,null,{"$f":"IF(Table1[[#This Row],[First service received]]=1,\"Never dropped\",IF(Table1[[#This Row],[Enrolled]]=1,\"No first service\",IF(Table1[[#This Row],[Expressed interest]]=1,\"Not enrolled\",IF(Table1[[#This Row],[Eligible]]=1,\"Not interested\",IF(Table1[[#This Row],[Contacted]]=1,\"Not eligible\",IF(Table1[[#This Row],[Identified]]=1,\"Not contacted\",\"\"))))))","v":"Not eligible"},{"$f":"_xlfn.CONCAT(Table1[[#This Row],[Reason not contacted]],Table1[[#This Row],[Reason not eligible]],Table1[[#This Row],[Reason not interested]],Table1[[#This Row],[Reason not enrolled]],Table1[[#This Row],[Reason first service not received]])","v":"Ineligible reason1"}]
[1612,null,"25 to 44 yrs","M","Non-Hispanic/Latino","White","No","Yes","No","Employed","2 to 6","Other","Non-work related","Non-workers comp","Industry 1","Occupation 3","Health provider","Worker’s comp database","County B","In person",1,1,null,1,null,0,"Impact on provider relationship",0,null,0,null,"2019-10-28","2019-11-02","2019-11-15",null,null,{"$f":"IF(Table1[[#This Row],[First service received]]=1,\"Never dropped\",IF(Table1[[#This Row],[Enrolled]]=1,\"No first service\",IF(Table1[[#This Row],[Expressed interest]]=1,\"Not enrolled\",IF(Table1[[#This Row],[Eligible]]=1,\"Not interested\",IF(Table1[[#This Row],[Contacted]]=1,\"Not eligible\",IF(Table1[[#This Row],[Identified]]=1,\"Not contacted\",\"\"))))))","v":"Not interested"},{"$f":"_xlfn.CONCAT(Table1[[#This Row],[Reason not contacted]],Table1[[#This Row],[Reason not eligible]],Table1[[#This Row],[Reason not interested]],Table1[[#This Row],[Reason not enrolled]],Table1[[#This Row],[Reason first service not received]])","v":"Impact on provider relationship"}]
[1124,null,"45 to 64 yrs","F","Non-Hispanic/Latino","White","Yes","Yes","No","Employed","2 to 6","MSK","Non-work related","Non-workers comp","Industry 1","Occupation 1","Self","Electronic Health Records","County B","Other",1,0,"Inaccurate contact info",0,null,0,null,0,null,0,null,"2019-10-29",null,null,null,null,{"$f":"IF(Table1[[#This Row],[First service received]]=1,\"Never dropped\",IF(Table1[[#This Row],[Enrolled]]=1,\"No first service\",IF(Table1[[#This Row],[Expressed interest]]=1,\"Not enrolled\",IF(Table1[[#This Row],[Eligible]]=1,\"Not interested\",IF(Table1[[#This Row],[Contacted]]=1,\"Not eligible\",IF(Table1[[#This Row],[Identified]]=1,\"Not contacted\",\"\"))))))","v":"Not contacted"},{"$f":"_xlfn.CONCAT(Table1[[#This Row],[Reason not contacted]],Table1[[#This Row],[Reason not eligible]],Table1[[#This Row],[Reason not interested]],Table1[[#This Row],[Reason not enrolled]],Table1[[#This Row],[Reason first service not received]])","v":"Inaccurate contact info"}]
[1166,null,"45 to 64 yrs","M","Non-Hispanic/Latino","White","Yes","Yes","No","Employed","13+ weeks","MSK","Work related","Non-workers comp","Industry 3","Occupation 2","Workforce partner","Electronic Health Records","County B","Phone",1,1,null,1,null,1,null,1,null,1,null,"2019-10-29","2019-11-08","2019-11-21","2019-11-25","2019-12-07",{"$f":"IF(Table1[[#This Row],[First service received]]=1,\"Never dropped\",IF(Table1[[#This Row],[Enrolled]]=1,\"No first service\",IF(Table1[[#This Row],[Expressed interest]]=1,\"Not enrolled\",IF(Table1[[#This Row],[Eligible]]=1,\"Not interested\",IF(Table1[[#This Row],[Contacted]]=1,\"Not eligible\",IF(Table1[[#This Row],[Identified]]=1,\"Not contacted\",\"\"))))))","v":"Never dropped"},{"$f":"_xlfn.CONCAT(Table1[[#This Row],[Reason not contacted]],Table1[[#This Row],[Reason not eligible]],Table1[[#This Row],[Reason not interested]],Table1[[#This Row],[Reason not enrolled]],Table1[[#This Row],[Reason first service not received]])","v":""}]
[1195,null,"25 to 44 yrs","M","Non-Hispanic/Latino","White","No","No","No","Employed","2 to 6","Cardio or Respiratory","Non-work related","Non-workers comp","Industry 1","Occupation 3","Health provider","Clinic appointment schedules","County B","Phone",1,1,null,1,null,1,null,0,"Not enrolled reason1",0,null,"2019-10-29","2019-11-13","2019-12-28",null,null,{"$f":"IF(Table1[[#This Row],[First service received]]=1,\"Never dropped\",IF(Table1[[#This Row],[Enrolled]]=1,\"No first service\",IF(Table1[[#This Row],[Expressed interest]]=1,\"Not enrolled\",IF(Table1[[#This Row],[Eligible]]=1,\"Not interested\",IF(Table1[[#This Row],[Contacted]]=1,\"Not eligible\",IF(Table1[[#This Row],[Identified]]=1,\"Not contacted\",\"\"))))))","v":"Not enrolled"},{"$f":"_xlfn.CONCAT(Table1[[#This Row],[Reason not contacted]],Table1[[#This Row],[Reason not eligible]],Table1[[#This Row],[Reason not interested]],Table1[[#This Row],[Reason not enrolled]],Table1[[#This Row],[Reason first service not received]])","v":"Not enrolled reason1"}]
[1579,null,"45 to 64 yrs","F","Non-Hispanic/Latino","White","No","Yes","No","Employed","7 to 12","MSK","Non-work related","Non-workers comp","Industry 3","Occupation 4","Health provider","Worker’s comp database","County C","Phone",1,1,null,0,"Ineligible reason2",0,null,0,null,0,null,"2019-10-29","2019-11-02","2019-11-04",null,null,{"$f":"IF(Table1[[#This Row],[First service received]]=1,\"Never dropped\",IF(Table1[[#This Row],[Enrolled]]=1,\"No first service\",IF(Table1[[#This Row],[Expressed interest]]=1,\"Not enrolled\",IF(Table1[[#This Row],[Eligible]]=1,\"Not interested\",IF(Table1[[#This Row],[Contacted]]=1,\"Not eligible\",IF(Table1[[#This Row],[Identified]]=1,\"Not contacted\",\"\"))))))","v":"Not eligible"},{"$f":"_xlfn.CONCAT(Table1[[#This Row],[Reason not contacted]],Table1[[#This Row],[Reason not eligible]],Table1[[#This Row],[Reason not interested]],Table1[[#This Row],[Reason not enrolled]],Table1[[#This Row],[Reason first service not received]])","v":"Ineligible reason2"}]
[1040,null,"45 to 64 yrs","M","Non-Hispanic/Latino","Black or African-American","Yes","Yes","No","Employed","2 to 6","MSK","Work related","Non-workers comp","Industry 1","Occupation 1","Health provider","FMLA forms","County A","Phone",1,0,"Contacted, no response",0,null,0,null,0,null,0,null,"2019-10-30",null,null,null,null,{"$f":"IF(Table1[[#This Row],[First service received]]=1,\"Never dropped\",IF(Table1[[#This Row],[Enrolled]]=1,\"No first service\",IF(Table1[[#This Row],[Expressed interest]]=1,\"Not enrolled\",IF(Table1[[#This Row],[Eligible]]=1,\"Not interested\",IF(Table1[[#This Row],[Contacted]]=1,\"Not eligible\",IF(Table1[[#This Row],[Identified]]=1,\"Not contacted\",\"\"))))))","v":"Not contacted"},{"$f":"_xlfn.CONCAT(Table1[[#This Row],[Reason not contacted]],Table1[[#This Row],[Reason not eligible]],Table1[[#This Row],[Reason not interested]],Table1[[#This Row],[Reason not enrolled]],Table1[[#This Row],[Reason first service not received]])","v":"Contacted, no response"}]
[1075,null,"25 to 44 yrs","F","Hispanic/Latino","White","Yes","Yes","No","Not Employed","0 to 1","Cardio or Respiratory","Non-work related","Non-workers comp","Industry 1","Occupation 3","Health provider","Worker’s comp database","County B","Phone",1,1,null,0,"Ineligible reason3",0,null,0,null,0,null,"2019-10-30","2019-11-10","2019-12-17",null,null,{"$f":"IF(Table1[[#This Row],[First service received]]=1,\"Never dropped\",IF(Table1[[#This Row],[Enrolled]]=1,\"No first service\",IF(Table1[[#This Row],[Expressed interest]]=1,\"Not enrolled\",IF(Table1[[#This Row],[Eligible]]=1,\"Not interested\",IF(Table1[[#This Row],[Contacted]]=1,\"Not eligible\",IF(Table1[[#This Row],[Identified]]=1,\"Not contacted\",\"\"))))))","v":"Not eligible"},{"$f":"_xlfn.CONCAT(Table1[[#This Row],[Reason not contacted]],Table1[[#This Row],[Reason not eligible]],Table1[[#This Row],[Reason not interested]],Table1[[#This Row],[Reason not enrolled]],Table1[[#This Row],[Reason first service not received]])","v":"Ineligible reason3"}]
[1125,null,"18 to 24 yrs","M","Non-Hispanic/Latino","White","Yes","Yes","No","Not Employed","0 to 1","Other","Work related","Workers comp","Industry 3","Occupation 3","Self","Electronic Health Records","County B","Phone",1,0,"Contacted, no response",0,null,0,null,0,null,0,null,"2019-10-30",null,null,null,null,{"$f":"IF(Table1[[#This Row],[First service received]]=1,\"Never dropped\",IF(Table1[[#This Row],[Enrolled]]=1,\"No first service\",IF(Table1[[#This Row],[Expressed interest]]=1,\"Not enrolled\",IF(Table1[[#This Row],[Eligible]]=1,\"Not interested\",IF(Table1[[#This Row],[Contacted]]=1,\"Not eligible\",IF(Table1[[#This Row],[Identified]]=1,\"Not contacted\",\"\"))))))","v":"Not contacted"},{"$f":"_xlfn.CONCAT(Table1[[#This Row],[Reason not contacted]],Table1[[#This Row],[Reason not eligible]],Table1[[#This Row],[Reason not interested]],Table1[[#This Row],[Reason not enrolled]],Table1[[#This Row],[Reason first service not received]])","v":"Contacted, no response"}]
[1184,null,"45 to 64 yrs","M","Non-Hispanic/Latino","White","Yes","Yes","No","Employed","2 to 6","MSK","Non-work related","Non-workers comp","Industry 2","Occupation 1","Health provider","Worker’s comp database","County B","In person",1,1,null,1,null,1,null,1,null,1,null,"2019-10-30","2019-11-05","2019-11-19","2019-11-30","2019-12-02",{"$f":"IF(Table1[[#This Row],[First service received]]=1,\"Never dropped\",IF(Table1[[#This Row],[Enrolled]]=1,\"No first service\",IF(Table1[[#This Row],[Expressed interest]]=1,\"Not enrolled\",IF(Table1[[#This Row],[Eligible]]=1,\"Not interested\",IF(Table1[[#This Row],[Contacted]]=1,\"Not eligible\",IF(Table1[[#This Row],[Identified]]=1,\"Not contacted\",\"\"))))))","v":"Never dropped"},{"$f":"_xlfn.CONCAT(Table1[[#This Row],[Reason not contacted]],Table1[[#This Row],[Reason not eligible]],Table1[[#This Row],[Reason not interested]],Table1[[#This Row],[Reason not enrolled]],Table1[[#This Row],[Reason first service not received]])","v":""}]
[1365,null,"45 to 64 yrs","M","Non-Hispanic/Latino","White","No","Yes","No","Not Employed","0 to 1","MSK","Non-work related","Non-workers comp","Industry 1","Occupation 1","Health provider","FMLA forms","County B","In person",1,1,null,1,null,0,"Impact on provider relationship",0,null,0,null,"2019-10-30","2019-11-06","2019-11-15",null,null,{"$f":"IF(Table1[[#This Row],[First service received]]=1,\"Never dropped\",IF(Table1[[#This Row],[Enrolled]]=1,\"No first service\",IF(Table1[[#This Row],[Expressed interest]]=1,\"Not enrolled\",IF(Table1[[#This Row],[Eligible]]=1,\"Not interested\",IF(Table1[[#This Row],[Contacted]]=1,\"Not eligible\",IF(Table1[[#This Row],[Identified]]=1,\"Not contacted\",\"\"))))))","v":"Not interested"},{"$f":"_xlfn.CONCAT(Table1[[#This Row],[Reason not contacted]],Table1[[#This Row],[Reason not eligible]],Table1[[#This Row],[Reason not interested]],Table1[[#This Row],[Reason not enrolled]],Table1[[#This Row],[Reason first service not received]])","v":"Impact on provider relationship"}]
[1134,null,"25 to 44 yrs","M","Non-Hispanic/Latino","American Indian or Alaska Native","Yes","No","No","Employed","7 to 12","MSK","Work related","Workers comp","Industry 1","Occupation 3","Health provider","Voc rehab centers","County B","Phone",1,1,null,1,null,1,null,1,null,1,null,"2019-10-31","2019-11-06","2019-11-19","2019-12-01","2019-12-10",{"$f":"IF(Table1[[#This Row],[First service received]]=1,\"Never dropped\",IF(Table1[[#This Row],[Enrolled]]=1,\"No first service\",IF(Table1[[#This Row],[Expressed interest]]=1,\"Not enrolled\",IF(Table1[[#This Row],[Eligible]]=1,\"Not interested\",IF(Table1[[#This Row],[Contacted]]=1,\"Not eligible\",IF(Table1[[#This Row],[Identified]]=1,\"Not contacted\",\"\"))))))","v":"Never dropped"},{"$f":"_xlfn.CONCAT(Table1[[#This Row],[Reason not contacted]],Table1[[#This Row],[Reason not eligible]],Table1[[#This Row],[Reason not interested]],Table1[[#This Row],[Reason not enrolled]],Table1[[#This Row],[Reason first service not received]])","v":""}]
[1375,null,"25 to 44 yrs","F","Hispanic/Latino","White","Yes","Yes","No","Employed","2 to 6","MSK","Non-work related","Non-workers comp","Industry 3","Occupation 2","Health provider","FMLA forms","County B","In person",1,1,null,1,null,0,"Don't want to be in research study",0,null,0,null,"2019-10-31","2019-11-07","2019-11-16",null,null,{"$f":"IF(Table1[[#This Row],[First service received]]=1,\"Never dropped\",IF(Table1[[#This Row],[Enrolled]]=1,\"No first service\",IF(Table1[[#This Row],[Expressed interest]]=1,\"Not enrolled\",IF(Table1[[#This Row],[Eligible]]=1,\"Not interested\",IF(Table1[[#This Row],[Contacted]]=1,\"Not eligible\",IF(Table1[[#This Row],[Identified]]=1,\"Not contacted\",\"\"))))))","v":"Not interested"},{"$f":"_xlfn.CONCAT(Table1[[#This Row],[Reason not contacted]],Table1[[#This Row],[Reason not eligible]],Table1[[#This Row],[Reason not interested]],Table1[[#This Row],[Reason not enrolled]],Table1[[#This Row],[Reason first service not received]])","v":"Don't want to be in research study"}]
[1398,null,"25 to 44 yrs","F","Non-Hispanic/Latino","Asian","Yes","Yes","No","Not Employed","0 to 1","MSK","Non-work related","Non-workers comp","Industry 1","Occupation 3","Health provider","Voc rehab centers","County B","Phone",1,1,null,0,"Ineligible reason1",0,null,0,null,0,null,"2019-10-31","2019-11-10","2019-12-24",null,null,{"$f":"IF(Table1[[#This Row],[First service received]]=1,\"Never dropped\",IF(Table1[[#This Row],[Enrolled]]=1,\"No first service\",IF(Table1[[#This Row],[Expressed interest]]=1,\"Not enrolled\",IF(Table1[[#This Row],[Eligible]]=1,\"Not interested\",IF(Table1[[#This Row],[Contacted]]=1,\"Not eligible\",IF(Table1[[#This Row],[Identified]]=1,\"Not contacted\",\"\"))))))","v":"Not eligible"},{"$f":"_xlfn.CONCAT(Table1[[#This Row],[Reason not contacted]],Table1[[#This Row],[Reason not eligible]],Table1[[#This Row],[Reason not interested]],Table1[[#This Row],[Reason not enrolled]],Table1[[#This Row],[Reason first service not received]])","v":"Ineligible reason1"}]

{"sheet":"funnel","index":2,"n_rows":17,"n_cols":2,"rows_kept":17,"cut":false,"hidden":true,"merged":[]}
["Sex","(All)"]
["Weeks since injury","(All)"]
["Primary injury/illness","(All)"]
["Work-related injury","(All)"]
["Workers comp","(All)"]
["Industry","(All)"]
["Occupation","(All)"]
["Referral type","(All)"]
["Referral source","(All)"]
[]
["Values"]
["Identified-",623]
["Contacted-",525]
["Eligible-",401]
["Expressed interest-",257]
["Enrolled-",217]
["First service received-",187]

{"sheet":"reason","index":3,"n_rows":16,"n_cols":2,"rows_kept":16,"cut":false,"hidden":true,"merged":[]}
["Stage dropped","Not contacted"]
["Sex","(All)"]
["Weeks since injury","(All)"]
["Primary injury/illness","(All)"]
["Work-related injury","(All)"]
["Workers comp","(All)"]
["Industry","(All)"]
["Occupation","(All)"]
["Referral type","(All)"]
["Referral source","(All)"]
[]
["Row Labels","Count of Reason dropped"]
["Inaccurate contact info",21]
["No contact info",21]
["Contacted, no response",56]
["Grand Total",98]

{"sheet":"trend","index":4,"n_rows":19,"n_cols":6,"rows_kept":19,"cut":false,"hidden":true,"merged":[]}
["Sex","(All)"]
["Employment status","(All)"]
["Weeks since injury","(All)"]
["Primary injury/illness","(All)"]
["Work-related injury","(All)"]
["Workers comp","(All)"]
["Industry","(All)"]
["Occupation","(All)"]
["Referral type","(All)"]
["Referral source","(All)"]
["Location","(All)"]
[]
["Row Labels","Identified ","Contacted ","Eligible  ","Enrolled ","First service received "]
["2019",623,525,401,217,187]
["Jul",142,112,85,40,34]
["Aug",141,116,85,40,38]
["Sep",202,185,157,104,88]
["Oct",138,112,74,33,27]
["Grand Total",623,525,401,217,187]